BDBM50081577 CHEMBL3422087
SMILES: O=C(N[C@H](C1CCCC1)c1ccccn1)c1ccc2[nH]nc(-c3ccc(cc3)N3C4CCC3COC4)c2c1
InChI Key: InChIKey=JQONSQMAQRQLRF-NZAOONQGSA-N
Data: 2 IC50
Activity Spreadsheet -- Enzyme Inhibition Constant Data from BindingDB
Found 2 hits for monomerid = 50081577
Trg + Lig
Ki
nM
ΔG°
kcal/mole
IC50
nM
Kd
nM
EC50/IC50
nM
koff
s-1
kon
M-1s-1
pHTemp
°C
Dual specificity protein kinase TTK
(Homo sapiens (Human))
BDBM50081577
(CHEMBL3422087)
Show SMILES O=C(N[C@H](C1CCCC1)c1ccccn1)c1ccc2[nH]nc(-c3ccc(cc3)N3C4CCC3COC4)c2c1 |r|
Show InChI InChI=1S/C31H33N5O2/c37-31(33-30(20-5-1-2-6-20)28-7-3-4-16-32-28)22-10-15-27-26(17-22)29(35-34-27)21-8-11-23(12-9-21)36-24-13-14-25(36)19-38-18-24/h3-4,7-12,15-17,20,24-25,30H,1-2,5-6,13-14,18-19H2,(H,33,37)(H,34,35)/t24?,25?,30-/m1/s1
n/an/a 4.60n/an/an/an/an/an/a
EntreMed Inc.
Curated by ChEMBL
Assay Description
Inhibition of amino terminal GST-fused full length human TTK using His6-SUMO-TTK-N as substrate preincubated for 15 mins prior to ATP addition by ind...
J Med Chem 58: 3366-92 (2015)
Article DOI: 10.1021/jm501740a
BindingDB Entry DOI: 10.7270/Q2Q52RCN
Cytochrome P450 3A4
(Homo sapiens (Human))
BDBM50081577
(CHEMBL3422087)
Show SMILES O=C(N[C@H](C1CCCC1)c1ccccn1)c1ccc2[nH]nc(-c3ccc(cc3)N3C4CCC3COC4)c2c1 |r|
Show InChI InChI=1S/C31H33N5O2/c37-31(33-30(20-5-1-2-6-20)28-7-3-4-16-32-28)22-10-15-27-26(17-22)29(35-34-27)21-8-11-23(12-9-21)36-24-13-14-25(36)19-38-18-24/h3-4,7-12,15-17,20,24-25,30H,1-2,5-6,13-14,18-19H2,(H,33,37)(H,34,35)/t24?,25?,30-/m1/s1
Reactome pathway
n/an/a 360n/an/an/an/an/an/a
EntreMed Inc.
Curated by ChEMBL
Assay Description
Inhibition of human CYP3A4 using BFC as substrate preincubated for 10 mins followed by enzyme/substrate addition measured after 30 mins by fluorescen...
J Med Chem 58: 3366-92 (2015)
Article DOI: 10.1021/jm501740a
BindingDB Entry DOI: 10.7270/Q2Q52RCN