BDBM50081608 CHEMBL3422081
SMILES: Fc1ccccc1[C@@H](NC(=O)c1ccc2[nH]nc(-c3ccc(cc3)N3C4CCC3COC4)c2c1)C1CC1
InChI Key:
Data: 1 IC50
Activity Spreadsheet -- Enzyme Inhibition Constant Data from BindingDB
Found 1 hit for monomerid = 50081608
Trg + Lig
Ki
nM
ΔG°
kcal/mole
IC50
nM
Kd
nM
EC50/IC50
nM
koff
s-1
kon
M-1s-1
pHTemp
°C
Dual specificity protein kinase TTK
(Homo sapiens (Human))
BDBM50081608
(CHEMBL3422081)
Show SMILES Fc1ccccc1[C@@H](NC(=O)c1ccc2[nH]nc(-c3ccc(cc3)N3C4CCC3COC4)c2c1)C1CC1 |r|
n/an/a 4.40n/an/an/an/an/an/a
EntreMed Inc.
Curated by ChEMBL
Assay Description
Inhibition of amino terminal GST-fused full length human TTK using His6-SUMO-TTK-N as substrate preincubated for 15 mins prior to ATP addition by ind...
J Med Chem 58: 3366-92 (2015)
Article DOI: 10.1021/jm501740a
BindingDB Entry DOI: 10.7270/Q2Q52RCN