BDBM50081643 CHEMBL3422240::US9260455, 2
SMILES: [H][C@@]12C[C@H](COC)OC[C@@]1(N=C(N)S[C@@H]2C)c1ccc(F)cc1F
InChI Key: InChIKey=VWZBYKQRKVQAQK-QBTOZTBISA-N
Data: 3 IC50
Activity Spreadsheet -- Enzyme Inhibition Constant Data from BindingDB
Found 3 hits for monomerid = 50081643
Trg + Lig
Ki
nM
ΔG°
kcal/mole
IC50
nM
Kd
nM
EC50/IC50
nM
koff
s-1
kon
M-1s-1
pHTemp
°C
Beta-secretase 1 (BACE1)
(Homo sapiens (Human))
BDBM50081643
(CHEMBL3422240 | US9260455, 2)
Show SMILES [H][C@@]12C[C@H](COC)OC[C@@]1(N=C(N)S[C@@H]2C)c1ccc(F)cc1F |r,t:11|
Show InChI InChI=1S/C16H20F2N2O2S/c1-9-13-6-11(7-21-2)22-8-16(13,20-15(19)23-9)12-4-3-10(17)5-14(12)18/h3-5,9,11,13H,6-8H2,1-2H3,(H2,19,20)/t9-,11-,13+,16-/m1/s1
US Patent
n/an/a 737n/an/an/an/a4.537
Pfizer Inc.
US Patent
Assay Description
A synthetic APP substrate that can be cleaved by beta-secretase having N-terminal biotin and made fluorescent by the covalent attachment of Oregon Gr...
US Patent US9260455 (2016)
BindingDB Entry DOI: 10.7270/Q2GB22WN
Beta-secretase 1
(Homo sapiens (Human))
BDBM50081643
(CHEMBL3422240 | US9260455, 2)
Show SMILES [H][C@@]12C[C@H](COC)OC[C@@]1(N=C(N)S[C@@H]2C)c1ccc(F)cc1F |r,t:11|
Show InChI InChI=1S/C16H20F2N2O2S/c1-9-13-6-11(7-21-2)22-8-16(13,20-15(19)23-9)12-4-3-10(17)5-14(12)18/h3-5,9,11,13H,6-8H2,1-2H3,(H2,19,20)/t9-,11-,13+,16-/m1/s1
n/an/a 800n/an/an/an/an/an/a
The Scripps Research Institute
Curated by ChEMBL
Assay Description
Inhibition of BACE1 in human H4 cells overexpressing wild type human APP695 assessed as colorimetric reaction by Whole cell assay
J Med Chem 58: 3223-52 (2015)
Article DOI: 10.1021/acs.jmedchem.5b00191
BindingDB Entry DOI: 10.7270/Q29W0H68
Beta-secretase 2
(Homo sapiens (Human))
BDBM50081643
(CHEMBL3422240 | US9260455, 2)
Show SMILES [H][C@@]12C[C@H](COC)OC[C@@]1(N=C(N)S[C@@H]2C)c1ccc(F)cc1F |r,t:11|
Show InChI InChI=1S/C16H20F2N2O2S/c1-9-13-6-11(7-21-2)22-8-16(13,20-15(19)23-9)12-4-3-10(17)5-14(12)18/h3-5,9,11,13H,6-8H2,1-2H3,(H2,19,20)/t9-,11-,13+,16-/m1/s1
US Patent
n/an/a 2.31E+3n/an/an/an/a4.537
Pfizer Inc.
US Patent
Assay Description
This assay measures the inhibition of the BACE2 enzyme as it cleaves a non-native peptide. A synthetic substrate that can be cleaved by BACE2 having ...
US Patent US9260455 (2016)
BindingDB Entry DOI: 10.7270/Q2GB22WN