BDBM50081644 CHEMBL3422239
SMILES: [H][C@]12CSC(N)=N[C@]1(CO[C@H](C2)c1cn[nH]c1)c1ccc(F)cc1F
InChI Key:
Data: 2 IC50
PDB links: 1 PDB ID matches this monomer.
Activity Spreadsheet -- Enzyme Inhibition Constant Data from BindingDB
Found 2 hits for monomerid = 50081644
Trg + Lig
Ki
nM
ΔG°
kcal/mole
IC50
nM
Kd
nM
EC50/IC50
nM
koff
s-1
kon
M-1s-1
pHTemp
°C
Cytochrome P450 2D6
(Homo sapiens (Human))
BDBM50081644
(CHEMBL3422239)
Show SMILES [H][C@]12CSC(N)=N[C@]1(CO[C@H](C2)c1cn[nH]c1)c1ccc(F)cc1F |r,c:5|
n/an/a 370n/an/an/an/an/an/a
The Scripps Research Institute
Curated by ChEMBL
Assay Description
Inhibition of CYP2D6 in human liver microsomes
J Med Chem 58: 3223-52 (2015)
Article DOI: 10.1021/acs.jmedchem.5b00191
BindingDB Entry DOI: 10.7270/Q29W0H68
3D
3D Structure (crystal)
Beta-secretase 1
(Homo sapiens (Human))
BDBM50081644
(CHEMBL3422239)
Show SMILES [H][C@]12CSC(N)=N[C@]1(CO[C@H](C2)c1cn[nH]c1)c1ccc(F)cc1F |r,c:5|
n/an/a 599n/an/an/an/an/an/a
The Scripps Research Institute
Curated by ChEMBL
Assay Description
Inhibition of BACE1 in human H4 cells overexpressing wild type human APP695 assessed as colorimetric reaction by Whole cell assay
J Med Chem 58: 3223-52 (2015)
Article DOI: 10.1021/acs.jmedchem.5b00191
BindingDB Entry DOI: 10.7270/Q29W0H68