BDBM50081723 CHEMBL3422343
SMILES: COc1ccc(OC)c2c3oc(cc(=O)c3cc(OC)c12)-c1ccc(OCc2ccccc2)cc1
InChI Key: InChIKey=IMQYKQIOGUZSFO-UHFFFAOYSA-N
Data: 3 IC50
Activity Spreadsheet -- Enzyme Inhibition Constant Data from BindingDB
Found 3 hits for monomerid = 50081723
Trg + Lig
Ki
nM
ΔG°
kcal/mole
IC50
nM
Kd
nM
EC50/IC50
nM
koff
s-1
kon
M-1s-1
pHTemp
°C
Cytochrome P450 1A
(Homo sapiens (Human))
BDBM50081723
(CHEMBL3422343)
Show SMILES COc1ccc(OC)c2c3oc(cc(=O)c3cc(OC)c12)-c1ccc(OCc2ccccc2)cc1
Show InChI InChI=1S/C29H24O6/c1-31-23-13-14-24(32-2)28-27(23)26(33-3)15-21-22(30)16-25(35-29(21)28)19-9-11-20(12-10-19)34-17-18-7-5-4-6-8-18/h4-16H,17H2,1-3H3
Reactome pathway
n/an/a 43n/an/an/an/an/an/a
Shanghai Jiao Tong University
Curated by ChEMBL
Assay Description
Inhibition of human CYP1A2 assessed as reduction in 7-ethoxyresorufin O-deethylation activity by fluorescence based EROD assay
J Med Chem 58: 3534-47 (2015)
Article DOI: 10.1021/acs.jmedchem.5b00265
BindingDB Entry DOI: 10.7270/Q2XP76NJ
Cytochrome P450 1A1
(Homo sapiens (Human))
BDBM50081723
(CHEMBL3422343)
Show SMILES COc1ccc(OC)c2c3oc(cc(=O)c3cc(OC)c12)-c1ccc(OCc2ccccc2)cc1
Show InChI InChI=1S/C29H24O6/c1-31-23-13-14-24(32-2)28-27(23)26(33-3)15-21-22(30)16-25(35-29(21)28)19-9-11-20(12-10-19)34-17-18-7-5-4-6-8-18/h4-16H,17H2,1-3H3
Reactome pathway
n/an/a 68n/an/an/an/an/an/a
Shanghai Jiao Tong University
Curated by ChEMBL
Assay Description
Inhibition of human CYP1A1 assessed as reduction in 7-ethoxyresorufin O-deethylation activity by fluorescence based EROD assay
J Med Chem 58: 3534-47 (2015)
Article DOI: 10.1021/acs.jmedchem.5b00265
BindingDB Entry DOI: 10.7270/Q2XP76NJ
Cytochrome P450 1B1
(Homo sapiens (Human))
BDBM50081723
(CHEMBL3422343)
Show SMILES COc1ccc(OC)c2c3oc(cc(=O)c3cc(OC)c12)-c1ccc(OCc2ccccc2)cc1
Show InChI InChI=1S/C29H24O6/c1-31-23-13-14-24(32-2)28-27(23)26(33-3)15-21-22(30)16-25(35-29(21)28)19-9-11-20(12-10-19)34-17-18-7-5-4-6-8-18/h4-16H,17H2,1-3H3
Reactome pathway
n/an/a 771n/an/an/an/an/an/a
Shanghai Jiao Tong University
Curated by ChEMBL
Assay Description
Inhibition of human CYP1B1 assessed as reduction in 7-ethoxyresorufin O-deethylation activity by fluorescence based EROD assay
J Med Chem 58: 3534-47 (2015)
Article DOI: 10.1021/acs.jmedchem.5b00265
BindingDB Entry DOI: 10.7270/Q2XP76NJ