BDBM50081835 (S)-[(S)-2-Amino-3-(4-hydroxy-phenyl)-propionylamino]-(3,4-dihydroxy-phenyl)-acetic acid::CHEMBL318546
SMILES: N[C@@H](Cc1ccc(O)cc1)C(=O)N[C@H](C(O)=O)c1ccc(O)c(O)c1
InChI Key: InChIKey=XRBKGQKWWAETRP-WFASDCNBSA-N
Data: 1 IC50
Activity Spreadsheet -- Enzyme Inhibition Constant Data from BindingDB
Found 1 hit for monomerid = 50081835
Trg + Lig
Ki
nM
ΔG°
kcal/mole
IC50
nM
Kd
nM
EC50/IC50
nM
koff
s-1
kon
M-1s-1
pHTemp
°C
Tyrosyl-tRNA synthetase
(Homo sapiens (Human))
BDBM50081835
((S)-[(S)-2-Amino-3-(4-hydroxy-phenyl)-propionylami...)
Show SMILES N[C@@H](Cc1ccc(O)cc1)C(=O)N[C@H](C(O)=O)c1ccc(O)c(O)c1
Show InChI InChI=1S/C17H18N2O6/c18-12(7-9-1-4-11(20)5-2-9)16(23)19-15(17(24)25)10-3-6-13(21)14(22)8-10/h1-6,8,12,15,20-22H,7,18H2,(H,19,23)(H,24,25)/t12-,15-/m0/s1
Reactome pathway
n/an/a 1.10E+4n/an/an/an/an/an/a
SmithKline Beecham Pharmaceuticals
Curated by ChEMBL
Assay Description
Compound was tested for inhibition of Staphylococcus aureus tyrosyl tRNA Synthetase
Bioorg Med Chem Lett 9: 2859-62 (1999)
BindingDB Entry DOI: 10.7270/Q2F18XX9