BDBM50082078 CHEMBL3422411
SMILES: CC(C)C[C@H](NC(=O)NNC(=O)[C@H](Cc1ccccc1)NC(=O)[C@H](CO)NC(=O)[C@H](CC(N)=O)NC(=O)[C@H](Cc1c[nH]c2ccccc12)NC(=O)[C@H](CC(N)=O)NC(=O)[C@H](Cc1ccc(O)cc1)NC(C)=O)C(=O)N[C@@H](CCCNC(N)=N)C(=O)N[C@@H](Cc1ccc(O)cc1)C(N)=O
InChI Key:
Data: 1 EC50
Activity Spreadsheet -- Enzyme Inhibition Constant Data from BindingDB
Found 1 hit for monomerid = 50082078
Trg + Lig
Ki
nM
ΔG°
kcal/mole
IC50
nM
Kd
nM
EC50/IC50
nM
koff
s-1
kon
M-1s-1
pHTemp
°C
G-protein Coupled Receptor 54
(Homo sapiens (Human))
BDBM50082078
(CHEMBL3422411)
Show SMILES CC(C)C[C@H](NC(=O)NNC(=O)[C@H](Cc1ccccc1)NC(=O)[C@H](CO)NC(=O)[C@H](CC(N)=O)NC(=O)[C@H](Cc1c[nH]c2ccccc12)NC(=O)[C@H](CC(N)=O)NC(=O)[C@H](Cc1ccc(O)cc1)NC(C)=O)C(=O)N[C@@H](CCCNC(N)=N)C(=O)N[C@@H](Cc1ccc(O)cc1)C(N)=O |r|
Reactome pathway
n/an/an/an/a 0.00600n/an/an/an/a
UMR7247; Universit£ Fran£ois Rabelais Tours; IFCE)
Curated by ChEMBL
Assay Description
Agonist activity at human wild-type KISS1R expressed in HEK293 cells assessed as induction of intracellular Ca2+ mobilization after 30 mins by Fluo4 ...
J Med Chem 58: 3459-70 (2015)
Article DOI: 10.1021/jm5019675
BindingDB Entry DOI: 10.7270/Q2JD4ZHJ