BDBM50082405 1-phenoxy-3-spiro[1,3-dihydrobenzo[e]isobenzofuran-3,4'-(hexahydropyridine)]-1-yl-(2S)-propan-2-ol::CHEMBL326751
SMILES: O[C@H](COc1ccccc1)CN1CCC2(CC1)OCc1c2ccc2ccccc12
InChI Key: InChIKey=AQHVRKAOCNHINO-FQEVSTJZSA-N
Data: 2 KI  1 EC50
Activity Spreadsheet -- Enzyme Inhibition Constant Data from BindingDB
Found 3 hits for monomerid = 50082405
Trg + Lig
Ki
nM
ΔG°
kcal/mole
IC50
nM
Kd
nM
EC50/IC50
nM
koff
s-1
kon
M-1s-1
pHTemp
°C
5-hydroxytryptamine receptor 1A
(Homo sapiens (Human))
BDBM50082405
(1-phenoxy-3-spiro[1,3-dihydrobenzo[e]isobenzofuran...)
Show SMILES O[C@H](COc1ccccc1)CN1CCC2(CC1)OCc1c2ccc2ccccc12
Show InChI InChI=1S/C25H27NO3/c27-20(17-28-21-7-2-1-3-8-21)16-26-14-12-25(13-15-26)24-11-10-19-6-4-5-9-22(19)23(24)18-29-25/h1-11,20,27H,12-18H2/t20-/m0/s1
1.10n/an/an/an/an/an/an/an/a
Merck
Curated by ChEMBL
Assay Description
Displacement of specific [3H]- 5-HT binding to cloned human 5-hydroxytryptamine 1A receptor stably expressed in HeLa cells
Bioorg Med Chem Lett 9: 3243-8 (1999)
BindingDB Entry DOI: 10.7270/Q2W37WVB
Sodium-dependent serotonin transporter
(Rattus norvegicus (rat))
BDBM50082405
(1-phenoxy-3-spiro[1,3-dihydrobenzo[e]isobenzofuran...)
Show SMILES O[C@H](COc1ccccc1)CN1CCC2(CC1)OCc1c2ccc2ccccc12
Show InChI InChI=1S/C25H27NO3/c27-20(17-28-21-7-2-1-3-8-21)16-26-14-12-25(13-15-26)24-11-10-19-6-4-5-9-22(19)23(24)18-29-25/h1-11,20,27H,12-18H2/t20-/m0/s1
50n/an/an/an/an/an/an/an/a
Merck
Curated by ChEMBL
Assay Description
Displacement of specific [3H]- citalopram binding to 5-HT uptake site in rat whole cortex
Bioorg Med Chem Lett 9: 3243-8 (1999)
BindingDB Entry DOI: 10.7270/Q2W37WVB
5-hydroxytryptamine receptor 1A
(Homo sapiens (Human))
BDBM50082405
(1-phenoxy-3-spiro[1,3-dihydrobenzo[e]isobenzofuran...)
Show SMILES O[C@H](COc1ccccc1)CN1CCC2(CC1)OCc1c2ccc2ccccc12
Show InChI InChI=1S/C25H27NO3/c27-20(17-28-21-7-2-1-3-8-21)16-26-14-12-25(13-15-26)24-11-10-19-6-4-5-9-22(19)23(24)18-29-25/h1-11,20,27H,12-18H2/t20-/m0/s1
n/an/an/an/a 1.20n/an/an/an/a
Merck
Curated by ChEMBL
Assay Description
Stimulation of [35S]- GIPyS binding to cloned human 5-hydroxytryptamine 1A receptor stably expressed in HeLa cells
Bioorg Med Chem Lett 9: 3243-8 (1999)
BindingDB Entry DOI: 10.7270/Q2W37WVB