BDBM50082406 1-(2-fluorophenoxy)-3-spiro[1,3-dihydrobenzo[e]isobenzofuran-3,4'-(hexahydropyridine)]-1-yl-(2S)-propan-2-ol::CHEMBL327126
SMILES: O[C@H](COc1ccccc1F)CN1CCC2(CC1)OCc1c2ccc2ccccc12
InChI Key: InChIKey=KEVOVRYMDHRZOO-IBGZPJMESA-N
Data: 2 KI  1 EC50
Activity Spreadsheet -- Enzyme Inhibition Constant Data from BindingDB
Found 3 hits for monomerid = 50082406
Trg + Lig
Ki
nM
ΔG°
kcal/mole
IC50
nM
Kd
nM
EC50/IC50
nM
koff
s-1
kon
M-1s-1
pHTemp
°C
5-hydroxytryptamine receptor 1A
(Homo sapiens (Human))
BDBM50082406
(1-(2-fluorophenoxy)-3-spiro[1,3-dihydrobenzo[e]iso...)
Show SMILES O[C@H](COc1ccccc1F)CN1CCC2(CC1)OCc1c2ccc2ccccc12
Show InChI InChI=1S/C25H26FNO3/c26-23-7-3-4-8-24(23)29-16-19(28)15-27-13-11-25(12-14-27)22-10-9-18-5-1-2-6-20(18)21(22)17-30-25/h1-10,19,28H,11-17H2/t19-/m0/s1
1n/an/an/an/an/an/an/an/a
Merck
Curated by ChEMBL
Assay Description
Displacement of specific [3H]- 5-HT binding to cloned human 5-hydroxytryptamine 1A receptor stably expressed in HeLa cells
Bioorg Med Chem Lett 9: 3243-8 (1999)
BindingDB Entry DOI: 10.7270/Q2W37WVB
Sodium-dependent serotonin transporter
(Rattus norvegicus (rat))
BDBM50082406
(1-(2-fluorophenoxy)-3-spiro[1,3-dihydrobenzo[e]iso...)
Show SMILES O[C@H](COc1ccccc1F)CN1CCC2(CC1)OCc1c2ccc2ccccc12
Show InChI InChI=1S/C25H26FNO3/c26-23-7-3-4-8-24(23)29-16-19(28)15-27-13-11-25(12-14-27)22-10-9-18-5-1-2-6-20(18)21(22)17-30-25/h1-10,19,28H,11-17H2/t19-/m0/s1
52n/an/an/an/an/an/an/an/a
Merck
Curated by ChEMBL
Assay Description
Displacement of specific [3H]- citalopram binding to 5-HT uptake site in rat whole cortex
Bioorg Med Chem Lett 9: 3243-8 (1999)
BindingDB Entry DOI: 10.7270/Q2W37WVB
5-hydroxytryptamine receptor 1A
(Homo sapiens (Human))
BDBM50082406
(1-(2-fluorophenoxy)-3-spiro[1,3-dihydrobenzo[e]iso...)
Show SMILES O[C@H](COc1ccccc1F)CN1CCC2(CC1)OCc1c2ccc2ccccc12
Show InChI InChI=1S/C25H26FNO3/c26-23-7-3-4-8-24(23)29-16-19(28)15-27-13-11-25(12-14-27)22-10-9-18-5-1-2-6-20(18)21(22)17-30-25/h1-10,19,28H,11-17H2/t19-/m0/s1
n/an/an/an/a 1.10n/an/an/an/a
Merck
Curated by ChEMBL
Assay Description
Stimulation of [35S]- GIPyS binding to cloned human 5-hydroxytryptamine 1A receptor stably expressed in HeLa cells
Bioorg Med Chem Lett 9: 3243-8 (1999)
BindingDB Entry DOI: 10.7270/Q2W37WVB