BDBM50082543 (S)-4-(4-Bromo-2-methyl-benzenesulfonyl)-2,2-dimethyl-[1,4]thiazepane-3-carboxylic acid hydroxyamide::(S)-4-(4-bromo-2-methylphenylsulfonyl)-N-hydroxy-2,2-dimethyl-1,4-thiazepane-3-carboxamide::CHEMBL139886
SMILES: Cc1cc(Br)ccc1S(=O)(=O)N1CCCSC(C)(C)[C@@H]1C(=O)NO
InChI Key: InChIKey=YTCCTPYUECNUFO-ZDUSSCGKSA-N
Data: 6 IC50
Activity Spreadsheet -- Enzyme Inhibition Constant Data from BindingDB
Found 6 hits for monomerid = 50082543
Trg + Lig
Ki
nM
ΔG°
kcal/mole
IC50
nM
Kd
nM
EC50/IC50
nM
koff
s-1
kon
M-1s-1
pHTemp
°C
Interstitial collagenase
(Homo sapiens (Human))
BDBM50082543
((S)-4-(4-Bromo-2-methyl-benzenesulfonyl)-2,2-dimet...)
Show SMILES Cc1cc(Br)ccc1S(=O)(=O)N1CCCSC(C)(C)[C@@H]1C(=O)NO
Show InChI InChI=1S/C15H21BrN2O4S2/c1-10-9-11(16)5-6-12(10)24(21,22)18-7-4-8-23-15(2,3)13(18)14(19)17-20/h5-6,9,13,20H,4,7-8H2,1-3H3,(H,17,19)/t13-/m0/s1
Reactome pathway
n/an/a 0.5n/an/an/an/an/an/a
Procter and Gamble Pharmaceuticals
Curated by ChEMBL
Assay Description
In vitro inhibitory activity against truncated collagenase-1 (matrix metalloprotease-1).
J Med Chem 42: 4547-62 (1999)
BindingDB Entry DOI: 10.7270/Q2D79C32
72 kDa type IV collagenase
(Homo sapiens (Human))
BDBM50082543
((S)-4-(4-Bromo-2-methyl-benzenesulfonyl)-2,2-dimet...)
Show SMILES Cc1cc(Br)ccc1S(=O)(=O)N1CCCSC(C)(C)[C@@H]1C(=O)NO
Show InChI InChI=1S/C15H21BrN2O4S2/c1-10-9-11(16)5-6-12(10)24(21,22)18-7-4-8-23-15(2,3)13(18)14(19)17-20/h5-6,9,13,20H,4,7-8H2,1-3H3,(H,17,19)/t13-/m0/s1
Reactome pathway
n/an/a 24n/an/an/an/an/an/a
Procter and Gamble Pharmaceuticals
Curated by ChEMBL
Assay Description
In vitro inhibitory activity against gelatinase-A (matrix metalloprotease-2).
J Med Chem 42: 4547-62 (1999)
BindingDB Entry DOI: 10.7270/Q2D79C32
Stromelysin-1
(Homo sapiens (Human))
BDBM50082543
((S)-4-(4-Bromo-2-methyl-benzenesulfonyl)-2,2-dimet...)
Show SMILES Cc1cc(Br)ccc1S(=O)(=O)N1CCCSC(C)(C)[C@@H]1C(=O)NO
Show InChI InChI=1S/C15H21BrN2O4S2/c1-10-9-11(16)5-6-12(10)24(21,22)18-7-4-8-23-15(2,3)13(18)14(19)17-20/h5-6,9,13,20H,4,7-8H2,1-3H3,(H,17,19)/t13-/m0/s1
Reactome pathway
n/an/a 87n/an/an/an/an/an/a
Pomona College
Curated by ChEMBL
Assay Description
Inhibition of MMP3
Bioorg Med Chem 15: 2223-68 (2007)
Article DOI: 10.1016/j.bmc.2007.01.011
BindingDB Entry DOI: 10.7270/Q2571DBD
Matrix metalloproteinase-7 (MMP7)
(Homo sapiens (Human))
BDBM50082543
((S)-4-(4-Bromo-2-methyl-benzenesulfonyl)-2,2-dimet...)
Show SMILES Cc1cc(Br)ccc1S(=O)(=O)N1CCCSC(C)(C)[C@@H]1C(=O)NO
Show InChI InChI=1S/C15H21BrN2O4S2/c1-10-9-11(16)5-6-12(10)24(21,22)18-7-4-8-23-15(2,3)13(18)14(19)17-20/h5-6,9,13,20H,4,7-8H2,1-3H3,(H,17,19)/t13-/m0/s1
Reactome pathway
n/an/a 354n/an/an/an/an/an/a
Procter and Gamble Pharmaceuticals
Curated by ChEMBL
Assay Description
In vitro inhibitory activity against matrilysin (matrix metalloprotease-7).
J Med Chem 42: 4547-62 (1999)
BindingDB Entry DOI: 10.7270/Q2D79C32
Stromelysin-1
(Homo sapiens (Human))
BDBM50082543
((S)-4-(4-Bromo-2-methyl-benzenesulfonyl)-2,2-dimet...)
Show SMILES Cc1cc(Br)ccc1S(=O)(=O)N1CCCSC(C)(C)[C@@H]1C(=O)NO
Show InChI InChI=1S/C15H21BrN2O4S2/c1-10-9-11(16)5-6-12(10)24(21,22)18-7-4-8-23-15(2,3)13(18)14(19)17-20/h5-6,9,13,20H,4,7-8H2,1-3H3,(H,17,19)/t13-/m0/s1
Reactome pathway
n/an/a 88n/an/an/an/an/an/a
Procter and Gamble Pharmaceuticals
Curated by ChEMBL
Assay Description
In vitro inhibitory activity against matrix metalloprotease-3.
J Med Chem 42: 4547-62 (1999)
BindingDB Entry DOI: 10.7270/Q2D79C32
Collagenase 3
(Homo sapiens (Human))
BDBM50082543
((S)-4-(4-Bromo-2-methyl-benzenesulfonyl)-2,2-dimet...)
Show SMILES Cc1cc(Br)ccc1S(=O)(=O)N1CCCSC(C)(C)[C@@H]1C(=O)NO
Show InChI InChI=1S/C15H21BrN2O4S2/c1-10-9-11(16)5-6-12(10)24(21,22)18-7-4-8-23-15(2,3)13(18)14(19)17-20/h5-6,9,13,20H,4,7-8H2,1-3H3,(H,17,19)/t13-/m0/s1
NCI pathway
Reactome pathway
n/an/a 9.20n/an/an/an/an/an/a
Procter and Gamble Pharmaceuticals
Curated by ChEMBL
Assay Description
In vitro inhibitory activity against collagenase-3 (matrix metalloprotease-13).
J Med Chem 42: 4547-62 (1999)
BindingDB Entry DOI: 10.7270/Q2D79C32