BDBM50082552 (S)-4-(4-Bromo-benzenesulfonyl)-2,2-dimethyl-1,1-dioxo-1lambda*6*-[1,4]thiazepane-3-carboxylic acid hydroxyamide::CHEMBL334909
SMILES: CC1(C)[C@@H](N(CCCS1(=O)=O)S(=O)(=O)c1ccc(Br)cc1)C(=O)NO
InChI Key: InChIKey=RMKNDVDQYWXAON-LBPRGKRZSA-N
Data: 6 IC50
Activity Spreadsheet -- Enzyme Inhibition Constant Data from BindingDB
Found 6 hits for monomerid = 50082552
Trg + Lig
Ki
nM
ΔG°
kcal/mole
IC50
nM
Kd
nM
EC50/IC50
nM
koff
s-1
kon
M-1s-1
pHTemp
°C
Stromelysin-1
(Homo sapiens (Human))
BDBM50082552
((S)-4-(4-Bromo-benzenesulfonyl)-2,2-dimethyl-1,1-d...)
Show SMILES CC1(C)[C@@H](N(CCCS1(=O)=O)S(=O)(=O)c1ccc(Br)cc1)C(=O)NO
Show InChI InChI=1S/C14H19BrN2O6S2/c1-14(2)12(13(18)16-19)17(8-3-9-24(14,20)21)25(22,23)11-6-4-10(15)5-7-11/h4-7,12,19H,3,8-9H2,1-2H3,(H,16,18)/t12-/m0/s1
Reactome pathway
n/an/a 90n/an/an/an/an/an/a
Procter and Gamble Pharmaceuticals
Curated by ChEMBL
Assay Description
In vitro inhibitory activity against matrix metalloprotease-3.
J Med Chem 42: 4547-62 (1999)
BindingDB Entry DOI: 10.7270/Q2D79C32
Interstitial collagenase
(Homo sapiens (Human))
BDBM50082552
((S)-4-(4-Bromo-benzenesulfonyl)-2,2-dimethyl-1,1-d...)
Show SMILES CC1(C)[C@@H](N(CCCS1(=O)=O)S(=O)(=O)c1ccc(Br)cc1)C(=O)NO
Show InChI InChI=1S/C14H19BrN2O6S2/c1-14(2)12(13(18)16-19)17(8-3-9-24(14,20)21)25(22,23)11-6-4-10(15)5-7-11/h4-7,12,19H,3,8-9H2,1-2H3,(H,16,18)/t12-/m0/s1
Reactome pathway
n/an/a 1.20n/an/an/an/an/an/a
Procter and Gamble Pharmaceuticals
Curated by ChEMBL
Assay Description
In vitro inhibitory activity against truncated collagenase-1 (matrix metalloprotease-1).
J Med Chem 42: 4547-62 (1999)
BindingDB Entry DOI: 10.7270/Q2D79C32
Stromelysin-1
(Homo sapiens (Human))
BDBM50082552
((S)-4-(4-Bromo-benzenesulfonyl)-2,2-dimethyl-1,1-d...)
Show SMILES CC1(C)[C@@H](N(CCCS1(=O)=O)S(=O)(=O)c1ccc(Br)cc1)C(=O)NO
Show InChI InChI=1S/C14H19BrN2O6S2/c1-14(2)12(13(18)16-19)17(8-3-9-24(14,20)21)25(22,23)11-6-4-10(15)5-7-11/h4-7,12,19H,3,8-9H2,1-2H3,(H,16,18)/t12-/m0/s1
Reactome pathway
n/an/a 89n/an/an/an/an/an/a
Pomona College
Curated by ChEMBL
Assay Description
Inhibition of MMP3
Bioorg Med Chem 15: 2223-68 (2007)
Article DOI: 10.1016/j.bmc.2007.01.011
BindingDB Entry DOI: 10.7270/Q2571DBD
Matrix metalloproteinase-7 (MMP7)
(Homo sapiens (Human))
BDBM50082552
((S)-4-(4-Bromo-benzenesulfonyl)-2,2-dimethyl-1,1-d...)
Show SMILES CC1(C)[C@@H](N(CCCS1(=O)=O)S(=O)(=O)c1ccc(Br)cc1)C(=O)NO
Show InChI InChI=1S/C14H19BrN2O6S2/c1-14(2)12(13(18)16-19)17(8-3-9-24(14,20)21)25(22,23)11-6-4-10(15)5-7-11/h4-7,12,19H,3,8-9H2,1-2H3,(H,16,18)/t12-/m0/s1
Reactome pathway
n/an/a 79n/an/an/an/an/an/a
Procter and Gamble Pharmaceuticals
Curated by ChEMBL
Assay Description
In vitro inhibitory activity against matrilysin (matrix metalloprotease-7).
J Med Chem 42: 4547-62 (1999)
BindingDB Entry DOI: 10.7270/Q2D79C32
72 kDa type IV collagenase
(Homo sapiens (Human))
BDBM50082552
((S)-4-(4-Bromo-benzenesulfonyl)-2,2-dimethyl-1,1-d...)
Show SMILES CC1(C)[C@@H](N(CCCS1(=O)=O)S(=O)(=O)c1ccc(Br)cc1)C(=O)NO
Show InChI InChI=1S/C14H19BrN2O6S2/c1-14(2)12(13(18)16-19)17(8-3-9-24(14,20)21)25(22,23)11-6-4-10(15)5-7-11/h4-7,12,19H,3,8-9H2,1-2H3,(H,16,18)/t12-/m0/s1
Reactome pathway
n/an/a 20n/an/an/an/an/an/a
Procter and Gamble Pharmaceuticals
Curated by ChEMBL
Assay Description
In vitro inhibitory activity against gelatinase-A (matrix metalloprotease-2).
J Med Chem 42: 4547-62 (1999)
BindingDB Entry DOI: 10.7270/Q2D79C32
Collagenase 3
(Homo sapiens (Human))
BDBM50082552
((S)-4-(4-Bromo-benzenesulfonyl)-2,2-dimethyl-1,1-d...)
Show SMILES CC1(C)[C@@H](N(CCCS1(=O)=O)S(=O)(=O)c1ccc(Br)cc1)C(=O)NO
Show InChI InChI=1S/C14H19BrN2O6S2/c1-14(2)12(13(18)16-19)17(8-3-9-24(14,20)21)25(22,23)11-6-4-10(15)5-7-11/h4-7,12,19H,3,8-9H2,1-2H3,(H,16,18)/t12-/m0/s1
NCI pathway
Reactome pathway
n/an/a 2.70n/an/an/an/an/an/a
Procter and Gamble Pharmaceuticals
Curated by ChEMBL
Assay Description
In vitro inhibitory activity against collagenase-3 (matrix metalloprotease-13).
J Med Chem 42: 4547-62 (1999)
BindingDB Entry DOI: 10.7270/Q2D79C32