BDBM50082678 5-[4-(4-Chloro-phenyl)-4-hydroxy-piperidin-1-yl]-2-(3-hydroxy-phenyl)-pentanenitrile::CHEMBL341840
SMILES: Oc1cccc(c1)C(CCCN1CCC(O)(CC1)c1ccc(Cl)cc1)C#N
InChI Key: InChIKey=WEYKBNXSBLQOIY-UHFFFAOYSA-N
Data: 1 KI  1 IC50
Activity Spreadsheet -- Enzyme Inhibition Constant Data from BindingDB
Found 2 hits for monomerid = 50082678
Trg + Lig
Ki
nM
ΔG°
kcal/mole
IC50
nM
Kd
nM
EC50/IC50
nM
koff
s-1
kon
M-1s-1
pHTemp
°C
C-C chemokine receptor type 1
(Homo sapiens (Human))
BDBM50082678
(5-[4-(4-Chloro-phenyl)-4-hydroxy-piperidin-1-yl]-2...)
Show SMILES Oc1cccc(c1)C(CCCN1CCC(O)(CC1)c1ccc(Cl)cc1)C#N
Show InChI InChI=1S/C22H25ClN2O2/c23-20-8-6-19(7-9-20)22(27)10-13-25(14-11-22)12-2-4-18(16-24)17-3-1-5-21(26)15-17/h1,3,5-9,15,18,26-27H,2,4,10-14H2
Reactome pathway
156n/an/an/an/an/an/an/an/a
Berlex Biosciences
Curated by ChEMBL
Assay Description
Inhibition of [125I]-MIP-1 alpha binding to recombinant human C-C chemokine receptor type 1 expressed in HEK293 cells
J Med Chem 42: 4680-94 (1999)
BindingDB Entry DOI: 10.7270/Q2125TCC
C-C chemokine receptor type 1
(Homo sapiens (Human))
BDBM50082678
(5-[4-(4-Chloro-phenyl)-4-hydroxy-piperidin-1-yl]-2...)
Show SMILES Oc1cccc(c1)C(CCCN1CCC(O)(CC1)c1ccc(Cl)cc1)C#N
Show InChI InChI=1S/C22H25ClN2O2/c23-20-8-6-19(7-9-20)22(27)10-13-25(14-11-22)12-2-4-18(16-24)17-3-1-5-21(26)15-17/h1,3,5-9,15,18,26-27H,2,4,10-14H2
Reactome pathway
n/an/a 9.00E+3n/an/an/an/an/an/a
Berlex Biosciences
Curated by ChEMBL
Assay Description
Inhibition of MIP-1-alpha-induced intracellular calcium mobilization in HEK293 cells expressing human CCR1 receptor
J Med Chem 42: 4680-94 (1999)
BindingDB Entry DOI: 10.7270/Q2125TCC