BDBM50082909 2-[(5-{[tert-Butoxycarbonyl-(2-cyclohexyl-ethyl)-amino]-methyl}-2'-methyl-biphenyl-2-carbonyl)-amino]-4-methylsulfanyl-lithium-butarate::CHEMBL367324
SMILES: CSCC[C@H](NC(=O)c1ccc(CN(CCC2CCCCC2)C(=O)OC(C)(C)C)cc1-c1ccccc1C)C([O-])=O
InChI Key: InChIKey=YXSNSWYENOSLMU-LJAQVGFWSA-M
Data: 1 IC50
Activity Spreadsheet -- Enzyme Inhibition Constant Data from BindingDB
Found 1 hit for monomerid = 50082909
Trg + Lig
Ki
nM
ΔG°
kcal/mole
IC50
nM
Kd
nM
EC50/IC50
nM
koff
s-1
kon
M-1s-1
pHTemp
°C
Protein Farnesyltransferase (PFT)/farnesyltransferase beta subunit
(Rattus norvegicus-Rattus norvegicus (rat))
BDBM50082909
(2-[(5-{[tert-Butoxycarbonyl-(2-cyclohexyl-ethyl)-a...)
Show SMILES CSCC[C@H](NC(=O)c1ccc(CN(CCC2CCCCC2)C(=O)OC(C)(C)C)cc1-c1ccccc1C)C([O-])=O
Show InChI InChI=1S/C33H46N2O5S/c1-23-11-9-10-14-26(23)28-21-25(15-16-27(28)30(36)34-29(31(37)38)18-20-41-5)22-35(32(39)40-33(2,3)4)19-17-24-12-7-6-8-13-24/h9-11,14-16,21,24,29H,6-8,12-13,17-20,22H2,1-5H3,(H,34,36)(H,37,38)/p-1/t29-/m0/s1
n/an/a 0.170n/an/an/an/an/an/a
Abbott Laboratories
Curated by ChEMBL
Assay Description
In vitro inhibitory activity against Farnesyltransferase (FTase)
J Med Chem 42: 4844-52 (1999)
BindingDB Entry DOI: 10.7270/Q2WW7GWR