null
SMILES: CSCC[C@H](NC(=O)c1ccc(CN[C@H](CSC2CCCCC2)CC2CCCCC2)cc1-c1ccccc1C)C(O)=O
InChI Key: InChIKey=RHBJBAOHXMJAFT-UVMMSNCQSA-N
Activity Spreadsheet -- Enzyme Inhibition Constant Data from BindingDB
Found 1 hit for monomerid = 50082919
Trg + Lig
Ki
nM
ΔG°
kcal/mole
IC50
nM
Kd
nM
EC50/IC50
nM
koff
s-1
kon
M-1s-1
pHTemp
°C
Protein farnesyltransferase subunit beta/geranylgeranyltransferase type-1 subunit alpha
(Rattus norvegicus-Rattus norvegicus (rat))
BDBM50082919
((S)-2-({5-[((S)-1-Cyclohexylmethyl-2-cyclohexylsul...)
Show SMILES CSCC[C@H](NC(=O)c1ccc(CN[C@H](CSC2CCCCC2)CC2CCCCC2)cc1-c1ccccc1C)C(O)=O
Show InChI InChI=1S/C35H50N2O3S2/c1-25-11-9-10-16-30(25)32-22-27(17-18-31(32)34(38)37-33(35(39)40)19-20-41-2)23-36-28(21-26-12-5-3-6-13-26)24-42-29-14-7-4-8-15-29/h9-11,16-18,22,26,28-29,33,36H,3-8,12-15,19-21,23-24H2,1-2H3,(H,37,38)(H,39,40)/t28-,33-/m0/s1
n/an/a 0.410n/an/an/an/an/an/a
Abbott Laboratories
Curated by ChEMBL
Assay Description
In vitro inhibitory activity against Farnesyltransferase (FTase)
J Med Chem 42: 4844-52 (1999)
BindingDB Entry DOI: 10.7270/Q2WW7GWR