null
SMILES: NC(=N)c1ccc(cc1)C(=O)Nc1ccc2CC(CC(O)=O)CCc2c1
InChI Key: InChIKey=ZNGZDOVQBYPJEY-UHFFFAOYSA-N
Activity Spreadsheet -- Enzyme Inhibition Constant Data from BindingDB
Found 1 hit for monomerid = 50082932
Trg + Lig
Ki
nM
ΔG°
kcal/mole
IC50
nM
Kd
nM
EC50/IC50
nM
koff
s-1
kon
M-1s-1
pHTemp
°C
Integrin alpha-IIb/beta-3
(Homo sapiens (Human))
BDBM50082932
(CHEMBL147258 | [6-(4-Carbamimidoyl-benzoylamino)-1...)
Show SMILES NC(=N)c1ccc(cc1)C(=O)Nc1ccc2CC(CC(O)=O)CCc2c1
Show InChI InChI=1S/C20H21N3O3/c21-19(22)13-3-5-14(6-4-13)20(26)23-17-8-7-15-9-12(10-18(24)25)1-2-16(15)11-17/h3-8,11-12H,1-2,9-10H2,(H3,21,22)(H,23,26)(H,24,25)
n/an/a 5n/an/an/an/an/an/a
Eli Lilly and Company
Curated by ChEMBL
Assay Description
Inhibition of fibrinogen binding to purified human alpha IIb beta3 integrin (GP IIb-IIIa)
J Med Chem 42: 4875-89 (1999)
BindingDB Entry DOI: 10.7270/Q2NC60DZ