BDBM50083070 CHEMBL3422848
SMILES: Oc1ccc(C2CC(=O)c3ccc(O)cc3O2)c(O)c1
InChI Key: InChIKey=JBQATDIMBVLPRB-UHFFFAOYSA-N
Data: 1 IC50
Activity Spreadsheet -- Enzyme Inhibition Constant Data from BindingDB
Found 1 hit for monomerid = 50083070
Trg + Lig
Ki
nM
ΔG°
kcal/mole
IC50
nM
Kd
nM
EC50/IC50
nM
koff
s-1
kon
M-1s-1
pHTemp
°C
Pancreatic lipase
(Sus scrofa (Pig))
BDBM50083070
(CHEMBL3422848)
Show SMILES Oc1ccc(C2CC(=O)c3ccc(O)cc3O2)c(O)c1
Show InChI InChI=1S/C15H12O5/c16-8-1-3-10(12(18)5-8)15-7-13(19)11-4-2-9(17)6-14(11)20-15/h1-6,15-18H,7H2
n/an/a 5.64E+4n/an/an/an/an/an/a
Chungbuk National University
Curated by ChEMBL
Assay Description
Inhibition of porcine pancreatic lipase using p-nitrophenylbutyrate as substrate assessed as formation of p-nitrophenol preincubated for 15 mins foll...
Bioorg Med Chem Lett 25: 2269-74 (2015)
Article DOI: 10.1016/j.bmcl.2015.04.045
BindingDB Entry DOI: 10.7270/Q2GF0W7B