BDBM50083649 CHEMBL112518::{4-[6-(3-Methyl-piperazin-1-yl)-pyridin-3-yl]-pyrimidin-2-yl}-(3,4,5-trimethoxy-phenyl)-amine
SMILES: COc1cc(Nc2nccc(n2)-c2ccc(nc2)N2CCNC(C)C2)cc(OC)c1OC
InChI Key: InChIKey=GIOJCQJQBGTVBI-UHFFFAOYSA-N
Data: 1 IC50
Activity Spreadsheet -- Enzyme Inhibition Constant Data from BindingDB
Found 1 hit for monomerid = 50083649
Trg + Lig
Ki
nM
ΔG°
kcal/mole
IC50
nM
Kd
nM
EC50/IC50
nM
koff
s-1
kon
M-1s-1
pHTemp
°C
Tyrosine-protein kinase ZAP-70
(Homo sapiens (Human))
BDBM50083649
(CHEMBL112518 | {4-[6-(3-Methyl-piperazin-1-yl)-pyr...)
Show SMILES COc1cc(Nc2nccc(n2)-c2ccc(nc2)N2CCNC(C)C2)cc(OC)c1OC
Show InChI InChI=1S/C23H28N6O3/c1-15-14-29(10-9-24-15)21-6-5-16(13-26-21)18-7-8-25-23(28-18)27-17-11-19(30-2)22(32-4)20(12-17)31-3/h5-8,11-13,15,24H,9-10,14H2,1-4H3,(H,25,27,28)
NCI pathway
Reactome pathway
n/an/a 26n/an/an/an/an/an/a
Celltech Therapeutics Limited
Curated by ChEMBL
Assay Description
Inhibition of Zeta-chain (TCR) associated protein kinase 70 kDa phosphorylation of polyGly-Tyr.
Bioorg Med Chem Lett 9: 3351-6 (2000)
BindingDB Entry DOI: 10.7270/Q29Z943G