null
SMILES: Brc1ccc(NC(=S)NCCN2CCOCC2)nc1
InChI Key: InChIKey=RDIVLNHYWPZVCL-UHFFFAOYSA-N
Activity Spreadsheet -- Enzyme Inhibition Constant Data from BindingDB
Found 1 hit for monomerid = 50083682
Trg + Lig
Ki
nM
ΔG°
kcal/mole
IC50
nM
Kd
nM
EC50/IC50
nM
koff
s-1
kon
M-1s-1
pHTemp
°C
Reverse transcriptase/RNaseH
(Human immunodeficiency virus 1)
BDBM50083682
(1-(5-Bromo-pyridin-2-yl)-3-(2-morpholin-4-yl-ethyl...)
Show SMILES Brc1ccc(NC(=S)NCCN2CCOCC2)nc1
Show InChI InChI=1S/C12H17BrN4OS/c13-10-1-2-11(15-9-10)16-12(19)14-3-4-17-5-7-18-8-6-17/h1-2,9H,3-8H2,(H2,14,15,16,19)
n/an/a>1.00E+5n/an/an/an/an/an/a
Institute
Curated by ChEMBL
Assay Description
Inhibition of recombinant reverse transcriptase (RT) in cell-free Quan-T-RT assay system
Bioorg Med Chem Lett 9: 3411-6 (2000)
BindingDB Entry DOI: 10.7270/Q2SX6CD8