null
SMILES: NC(=O)[C@@H]1O[C@@H]1C(=O)Nc1ccc(Oc2ccc(cc2)[N+]([O-])=O)cc1
InChI Key: InChIKey=MTTOYNOZVFDKFV-KGLIPLIRSA-N
Activity Spreadsheet -- Enzyme Inhibition Constant Data from BindingDB
Found 1 hit for monomerid = 50083719
Trg + Lig
Ki
nM
ΔG°
kcal/mole
IC50
nM
Kd
nM
EC50/IC50
nM
koff
s-1
kon
M-1s-1
pHTemp
°C
Coagulation factor XIII A chain
(Homo sapiens (Human))
BDBM50083719
(CHEMBL3423201)
Show SMILES NC(=O)[C@@H]1O[C@@H]1C(=O)Nc1ccc(Oc2ccc(cc2)[N+]([O-])=O)cc1 |r|
Show InChI InChI=1S/C16H13N3O6/c17-15(20)13-14(25-13)16(21)18-9-1-5-11(6-2-9)24-12-7-3-10(4-8-12)19(22)23/h1-8,13-14H,(H2,17,20)(H,18,21)/t13-,14+/m1/s1
Reactome pathway
n/an/a 430n/an/an/an/an/an/a
University of Leeds
Curated by ChEMBL
Assay Description
Inhibition of thrombin-activated F13-A (unknown origin) in plasma assessed as inhibition of fibrin clot formation after 7 mins by biotin incorporatio...
Eur J Med Chem 98: 49-53 (2015)
Article DOI: 10.1016/j.ejmech.2015.05.019
BindingDB Entry DOI: 10.7270/Q261121G