BDBM50083722 CHEMBL3423198
SMILES: NC(=O)[C@@H]1O[C@@H]1C(=O)Nc1ccc(Br)c(Cl)c1
InChI Key: InChIKey=FQJALHVQVRBZAV-SFYZADRCSA-N
Data: 2 IC50
Activity Spreadsheet -- Enzyme Inhibition Constant Data from BindingDB
Found 2 hits for monomerid = 50083722
Trg + Lig
Ki
nM
ΔG°
kcal/mole
IC50
nM
Kd
nM
EC50/IC50
nM
koff
s-1
kon
M-1s-1
pHTemp
°C
Protein-glutamine gamma-glutamyltransferase 2
(Homo sapiens (Human))
BDBM50083722
(CHEMBL3423198)
Show SMILES NC(=O)[C@@H]1O[C@@H]1C(=O)Nc1ccc(Br)c(Cl)c1 |r|
Show InChI InChI=1S/C10H8BrClN2O3/c11-5-2-1-4(3-6(5)12)14-10(16)8-7(17-8)9(13)15/h1-3,7-8H,(H2,13,15)(H,14,16)/t7-,8+/m1/s1
n/an/a 9.60n/an/an/an/an/an/a
University of Leeds
Curated by ChEMBL
Assay Description
Inhibition of transglutaminase 2 (unknown origin)
Eur J Med Chem 98: 49-53 (2015)
Article DOI: 10.1016/j.ejmech.2015.05.019
BindingDB Entry DOI: 10.7270/Q261121G
Coagulation factor XIII A chain
(Homo sapiens (Human))
BDBM50083722
(CHEMBL3423198)
Show SMILES NC(=O)[C@@H]1O[C@@H]1C(=O)Nc1ccc(Br)c(Cl)c1 |r|
Show InChI InChI=1S/C10H8BrClN2O3/c11-5-2-1-4(3-6(5)12)14-10(16)8-7(17-8)9(13)15/h1-3,7-8H,(H2,13,15)(H,14,16)/t7-,8+/m1/s1
Reactome pathway
n/an/a 4n/an/an/an/an/an/a
University of Leeds
Curated by ChEMBL
Assay Description
Inhibition of thrombin-activated F13-A (unknown origin) in plasma assessed as inhibition of fibrin clot formation after 7 mins by biotin incorporatio...
Eur J Med Chem 98: 49-53 (2015)
Article DOI: 10.1016/j.ejmech.2015.05.019
BindingDB Entry DOI: 10.7270/Q261121G