null
SMILES: OC(=O)[C@H](CNC(=O)C1=NOC(CCCCNc2ncc[nH]2)C1)NS(=O)(=O)c1c(Cl)cc(cc1Cl)-c1ccccc1
InChI Key: InChIKey=FHIDQJNETPMUKT-YSYXNDDBSA-N
Activity Spreadsheet -- Enzyme Inhibition Constant Data from BindingDB
Found 2 hits for monomerid = 50083766
Trg + Lig
Ki
nM
ΔG°
kcal/mole
IC50
nM
Kd
nM
EC50/IC50
nM
koff
s-1
kon
M-1s-1
pHTemp
°C
Integrin alpha-IIb/beta-3
(Homo sapiens (Human))
BDBM50083766
(2-(3,5-Dichloro-biphenyl-4-sulfonylamino)-3-({5-[4...)
Show SMILES OC(=O)[C@H](CNC(=O)C1=NOC(CCCCNc2ncc[nH]2)C1)NS(=O)(=O)c1c(Cl)cc(cc1Cl)-c1ccccc1 |t:8|
Show InChI InChI=1S/C26H28Cl2N6O6S/c27-19-12-17(16-6-2-1-3-7-16)13-20(28)23(19)41(38,39)34-22(25(36)37)15-32-24(35)21-14-18(40-33-21)8-4-5-9-29-26-30-10-11-31-26/h1-3,6-7,10-13,18,22,34H,4-5,8-9,14-15H2,(H,32,35)(H,36,37)(H2,29,30,31)/t18?,22-/m0/s1
n/an/a 1.60E+3n/an/an/an/an/an/a
DuPont Pharmaceuticals Company
Curated by ChEMBL
Assay Description
Inhibition of platelet aggregation in human platelet rich plasma (PRP)
J Med Chem 43: 27-40 (2000)
BindingDB Entry DOI: 10.7270/Q2571B77
Integrin alpha-V/beta-3
(Homo sapiens (Human))
BDBM50083766
(2-(3,5-Dichloro-biphenyl-4-sulfonylamino)-3-({5-[4...)
Show SMILES OC(=O)[C@H](CNC(=O)C1=NOC(CCCCNc2ncc[nH]2)C1)NS(=O)(=O)c1c(Cl)cc(cc1Cl)-c1ccccc1 |t:8|
Show InChI InChI=1S/C26H28Cl2N6O6S/c27-19-12-17(16-6-2-1-3-7-16)13-20(28)23(19)41(38,39)34-22(25(36)37)15-32-24(35)21-14-18(40-33-21)8-4-5-9-29-26-30-10-11-31-26/h1-3,6-7,10-13,18,22,34H,4-5,8-9,14-15H2,(H,32,35)(H,36,37)(H2,29,30,31)/t18?,22-/m0/s1
n/an/a 4.60n/an/an/an/an/an/a
DuPont Pharmaceuticals Company
Curated by ChEMBL
Assay Description
Inhibition of vitronectin receptor (alpha V beta 3), expressed on human 293 cells, binding to immobilized fibrinogen
J Med Chem 43: 27-40 (2000)
BindingDB Entry DOI: 10.7270/Q2571B77