BDBM50083866 3-Hept-1-enyl-6,6,9-trimethyl-6a,7,10,10a-tetrahydro-6H-benzo[c]chromen-1-ol::CHEMBL161874
SMILES: CCCCC\C=C\c1cc(O)c2C3CC(C)=CCC3C(C)(C)Oc2c1
InChI Key: InChIKey=UWYQDLYLKSLKNZ-MDZDMXLPSA-N
Data: 1 Kd
Activity Spreadsheet -- Enzyme Inhibition Constant Data from BindingDB
Found 1 hit for monomerid = 50083866
Trg + Lig
Ki
nM
ΔG°
kcal/mole
IC50
nM
Kd
nM
EC50/IC50
nM
koff
s-1
kon
M-1s-1
pHTemp
°C
Cannabinoid receptor 1
(Homo sapiens (Human))
BDBM50083866
(3-Hept-1-enyl-6,6,9-trimethyl-6a,7,10,10a-tetrahyd...)
Show SMILES CCCCC\C=C\c1cc(O)c2C3CC(C)=CCC3C(C)(C)Oc2c1 |c:15|
Show InChI InChI=1S/C23H32O2/c1-5-6-7-8-9-10-17-14-20(24)22-18-13-16(2)11-12-19(18)23(3,4)25-21(22)15-17/h9-11,14-15,18-19,24H,5-8,12-13H2,1-4H3/b10-9+
NCI pathway
Reactome pathway
n/an/an/a 0.860n/an/an/an/an/a
Research Triangle Institute
Curated by ChEMBL
Assay Description
Binding affinity against Cannabinoid receptor 1.
J Med Chem 43: 59-70 (2000)
BindingDB Entry DOI: 10.7270/Q2WQ0305