BDBM50084259 CHEMBL3425960
SMILES: FC(F)(F)CN1CCC(CC1)NC(=O)c1ccc(nc1)N1CCCCC1
InChI Key: InChIKey=RDABQOSUECGDJJ-UHFFFAOYSA-N
Data: 1 IC50  1 Kd
Activity Spreadsheet -- Enzyme Inhibition Constant Data from BindingDB
Found 2 hits for monomerid = 50084259
Trg + Lig
Ki
nM
ΔG°
kcal/mole
IC50
nM
Kd
nM
EC50/IC50
nM
koff
s-1
kon
M-1s-1
pHTemp
°C
Prostaglandin D Synthase
(Homo sapiens (Human))
BDBM50084259
(CHEMBL3425960)
Show SMILES FC(F)(F)CN1CCC(CC1)NC(=O)c1ccc(nc1)N1CCCCC1
Show InChI InChI=1S/C18H25F3N4O/c19-18(20,21)13-24-10-6-15(7-11-24)23-17(26)14-4-5-16(22-12-14)25-8-2-1-3-9-25/h4-5,12,15H,1-3,6-11,13H2,(H,23,26)
Reactome pathway
n/an/a 48n/an/an/an/an/an/a
AstraZeneca
Curated by ChEMBL
Assay Description
Inhibition human HPGDS expressed in Escherichia coli assessed as reduction in GST enzymatic activity using MCBL and glutathione incubated for 30 mins...
Bioorg Med Chem Lett 25: 2496-500 (2015)
Article DOI: 10.1016/j.bmcl.2015.04.065
BindingDB Entry DOI: 10.7270/Q2J9683M
Prostaglandin D Synthase
(Homo sapiens (Human))
BDBM50084259
(CHEMBL3425960)
Show SMILES FC(F)(F)CN1CCC(CC1)NC(=O)c1ccc(nc1)N1CCCCC1
Show InChI InChI=1S/C18H25F3N4O/c19-18(20,21)13-24-10-6-15(7-11-24)23-17(26)14-4-5-16(22-12-14)25-8-2-1-3-9-25/h4-5,12,15H,1-3,6-11,13H2,(H,23,26)
Reactome pathway
n/an/an/a<100n/an/an/an/an/a
AstraZeneca
Curated by ChEMBL
Assay Description
Binding affinity to human HPGDS expressed in Escherichia coli using 1-phenylpyrazole-4-carboxylic acid/6-(3-fluorophenyl)pyridine-3-carboxamide as re...
Bioorg Med Chem Lett 25: 2496-500 (2015)
Article DOI: 10.1016/j.bmcl.2015.04.065
BindingDB Entry DOI: 10.7270/Q2J9683M