BDBM50084434 CHEMBL3426695
SMILES: COc1c(CNC[C@H](O)c2ccc(O)c3[nH]c(=O)ccc23)ccc(NC(=O)CCN2CCC(CC2)OC(=O)Nc2ccccc2-c2ccccc2)c1C
InChI Key: InChIKey=AXDVKUKWTWDJJY-BHVANESWSA-N
Data: 1 KI  1 EC50
Activity Spreadsheet -- Enzyme Inhibition Constant Data from BindingDB
Found 2 hits for monomerid = 50084434
Trg + Lig
Ki
nM
ΔG°
kcal/mole
IC50
nM
Kd
nM
EC50/IC50
nM
koff
s-1
kon
M-1s-1
pHTemp
°C
Muscarinic acetylcholine receptor M3
(Homo sapiens (Human))
BDBM50084434
(CHEMBL3426695)
Show SMILES COc1c(CNC[C@H](O)c2ccc(O)c3[nH]c(=O)ccc23)ccc(NC(=O)CCN2CCC(CC2)OC(=O)Nc2ccccc2-c2ccccc2)c1C |r|
Show InChI InChI=1S/C41H45N5O7/c1-26-33(15-12-28(40(26)52-2)24-42-25-36(48)31-13-16-35(47)39-32(31)14-17-37(49)45-39)43-38(50)20-23-46-21-18-29(19-22-46)53-41(51)44-34-11-7-6-10-30(34)27-8-4-3-5-9-27/h3-17,29,36,42,47-48H,18-25H2,1-2H3,(H,43,50)(H,44,51)(H,45,49)/t36-/m0/s1
Reactome pathway
0.501n/an/an/an/an/an/an/an/a
Theravance Biopharma, Inc.
Curated by ChEMBL
Assay Description
Displacement of [3H]NMS from human muscarinic M3 receptor expressing CHO-K1 cells incubated for 60 mins or 6 hrs by liquid scintillation counting
J Med Chem 58: 2609-22 (2015)
Article DOI: 10.1021/jm501915g
BindingDB Entry DOI: 10.7270/Q2N29ZNQ
Beta-2 adrenergic receptor
(Homo sapiens (Human))
BDBM50084434
(CHEMBL3426695)
Show SMILES COc1c(CNC[C@H](O)c2ccc(O)c3[nH]c(=O)ccc23)ccc(NC(=O)CCN2CCC(CC2)OC(=O)Nc2ccccc2-c2ccccc2)c1C |r|
Show InChI InChI=1S/C41H45N5O7/c1-26-33(15-12-28(40(26)52-2)24-42-25-36(48)31-13-16-35(47)39-32(31)14-17-37(49)45-39)43-38(50)20-23-46-21-18-29(19-22-46)53-41(51)44-34-11-7-6-10-30(34)27-8-4-3-5-9-27/h3-17,29,36,42,47-48H,18-25H2,1-2H3,(H,43,50)(H,44,51)(H,45,49)/t36-/m0/s1
Reactome pathway
n/an/an/an/a 0.251n/an/an/an/a
Theravance Biopharma, Inc.
Curated by ChEMBL
Assay Description
Agonist activity at human beta2 adrenergic receptor expressed in HEK293 cells assessed as cAMP accumulation using [125I]cAMP by scintillation countin...
J Med Chem 58: 2609-22 (2015)
Article DOI: 10.1021/jm501915g
BindingDB Entry DOI: 10.7270/Q2N29ZNQ