BDBM50084438 CHEMBL3426692
SMILES: COc1c(CNC[C@H](O)c2ccc(O)c3[nH]c(=O)ccc23)ccc(NC(=O)CCN2CCC(CC2)OC(=O)Nc2ccccc2-c2ccccc2)c1Cl
InChI Key: InChIKey=IHTRAWRWVJOGMS-UMSFTDKQSA-N
Data: 1 KI  1 EC50
Activity Spreadsheet -- Enzyme Inhibition Constant Data from BindingDB
Found 2 hits for monomerid = 50084438
Trg + Lig
Ki
nM
ΔG°
kcal/mole
IC50
nM
Kd
nM
EC50/IC50
nM
koff
s-1
kon
M-1s-1
pHTemp
°C
Muscarinic acetylcholine receptor M3
(Homo sapiens (Human))
BDBM50084438
(CHEMBL3426692)
Show SMILES COc1c(CNC[C@H](O)c2ccc(O)c3[nH]c(=O)ccc23)ccc(NC(=O)CCN2CCC(CC2)OC(=O)Nc2ccccc2-c2ccccc2)c1Cl |r|
Show InChI InChI=1S/C40H42ClN5O7/c1-52-39-26(23-42-24-34(48)29-12-15-33(47)38-30(29)13-16-35(49)45-38)11-14-32(37(39)41)43-36(50)19-22-46-20-17-27(18-21-46)53-40(51)44-31-10-6-5-9-28(31)25-7-3-2-4-8-25/h2-16,27,34,42,47-48H,17-24H2,1H3,(H,43,50)(H,44,51)(H,45,49)/t34-/m0/s1
Reactome pathway
0.631n/an/an/an/an/an/an/an/a
Theravance Biopharma, Inc.
Curated by ChEMBL
Assay Description
Displacement of [3H]NMS from human muscarinic M3 receptor expressing CHO-K1 cells incubated for 60 mins or 6 hrs by liquid scintillation counting
J Med Chem 58: 2609-22 (2015)
Article DOI: 10.1021/jm501915g
BindingDB Entry DOI: 10.7270/Q2N29ZNQ
Beta-2 adrenergic receptor
(Homo sapiens (Human))
BDBM50084438
(CHEMBL3426692)
Show SMILES COc1c(CNC[C@H](O)c2ccc(O)c3[nH]c(=O)ccc23)ccc(NC(=O)CCN2CCC(CC2)OC(=O)Nc2ccccc2-c2ccccc2)c1Cl |r|
Show InChI InChI=1S/C40H42ClN5O7/c1-52-39-26(23-42-24-34(48)29-12-15-33(47)38-30(29)13-16-35(49)45-38)11-14-32(37(39)41)43-36(50)19-22-46-20-17-27(18-21-46)53-40(51)44-31-10-6-5-9-28(31)25-7-3-2-4-8-25/h2-16,27,34,42,47-48H,17-24H2,1H3,(H,43,50)(H,44,51)(H,45,49)/t34-/m0/s1
Reactome pathway
n/an/an/an/a 0.398n/an/an/an/a
Theravance Biopharma, Inc.
Curated by ChEMBL
Assay Description
Agonist activity at human beta2 adrenergic receptor expressed in HEK293 cells assessed as cAMP accumulation using [125I]cAMP by scintillation countin...
J Med Chem 58: 2609-22 (2015)
Article DOI: 10.1021/jm501915g
BindingDB Entry DOI: 10.7270/Q2N29ZNQ