BDBM50084830 4-[4-(5,5,8,8-Tetramethyl-5,6,7,8-tetrahydro-quinoxalin-2-yl)-thiazol-2-yl]-benzoic acid::CHEMBL336311
SMILES: CC1(C)CCC(C)(C)c2nc(cnc12)-c1csc(n1)-c1ccc(cc1)C(O)=O
InChI Key: InChIKey=RLBKELXRLMNRJB-UHFFFAOYSA-N
Data: 3 IC50
Activity Spreadsheet -- Enzyme Inhibition Constant Data from BindingDB
Found 3 hits for monomerid = 50084830
Trg + Lig
Ki
nM
ΔG°
kcal/mole
IC50
nM
Kd
nM
EC50/IC50
nM
koff
s-1
kon
M-1s-1
pHTemp
°C
Retinoid receptor
(Homo sapiens (Human))
BDBM50084830
(4-[4-(5,5,8,8-Tetramethyl-5,6,7,8-tetrahydro-quino...)
Show SMILES CC1(C)CCC(C)(C)c2nc(cnc12)-c1csc(n1)-c1ccc(cc1)C(O)=O
Show InChI InChI=1S/C22H23N3O2S/c1-21(2)9-10-22(3,4)18-17(21)23-11-15(24-18)16-12-28-19(25-16)13-5-7-14(8-6-13)20(26)27/h5-8,11-12H,9-10H2,1-4H3,(H,26,27)
Reactome pathway
n/an/a 3.60n/an/an/an/an/an/a
Eisai Co., Ltd.
Curated by ChEMBL
Assay Description
Binding affinity for Retinoic Acid Receptor gamma (RAR gamma)
J Med Chem 43: 409-19 (2000)
BindingDB Entry DOI: 10.7270/Q28S4P4M
Retinoid X receptor gamma/retinoic acid receptor alpha
(Homo sapiens (Human))
BDBM50084830
(4-[4-(5,5,8,8-Tetramethyl-5,6,7,8-tetrahydro-quino...)
Show SMILES CC1(C)CCC(C)(C)c2nc(cnc12)-c1csc(n1)-c1ccc(cc1)C(O)=O
Show InChI InChI=1S/C22H23N3O2S/c1-21(2)9-10-22(3,4)18-17(21)23-11-15(24-18)16-12-28-19(25-16)13-5-7-14(8-6-13)20(26)27/h5-8,11-12H,9-10H2,1-4H3,(H,26,27)
NCI pathway
Reactome pathway
n/an/a 83n/an/an/an/an/an/a
Eisai Co., Ltd.
Curated by ChEMBL
Assay Description
Binding affinity for Retinoic Acid Receptor alpha (RAR alpha)
J Med Chem 43: 409-19 (2000)
BindingDB Entry DOI: 10.7270/Q28S4P4M
Retinoid receptor
(Homo sapiens (Human))
BDBM50084830
(4-[4-(5,5,8,8-Tetramethyl-5,6,7,8-tetrahydro-quino...)
Show SMILES CC1(C)CCC(C)(C)c2nc(cnc12)-c1csc(n1)-c1ccc(cc1)C(O)=O
Show InChI InChI=1S/C22H23N3O2S/c1-21(2)9-10-22(3,4)18-17(21)23-11-15(24-18)16-12-28-19(25-16)13-5-7-14(8-6-13)20(26)27/h5-8,11-12H,9-10H2,1-4H3,(H,26,27)
Reactome pathway
n/an/a 21n/an/an/an/an/an/a
Eisai Co., Ltd.
Curated by ChEMBL
Assay Description
Binding affinity for Retinoic Acid Receptor beta (RAR beta)
J Med Chem 43: 409-19 (2000)
BindingDB Entry DOI: 10.7270/Q28S4P4M