BDBM50084923 CHEMBL3427360
SMILES: Oc1ccc(\C=N\N2CCC(CC2)c2ccccc2)c(O)c1
InChI Key: InChIKey=NWSFUOLAJZBQND-CPNJWEJPSA-N
Data: 1 IC50
Activity Spreadsheet -- Enzyme Inhibition Constant Data from BindingDB
Found 1 hit for monomerid = 50084923
Trg + Lig
Ki
nM
ΔG°
kcal/mole
IC50
nM
Kd
nM
EC50/IC50
nM
koff
s-1
kon
M-1s-1
pHTemp
°C
Patatin-like phospholipase domain-containing protein 2
(Mus musculus)
BDBM50084923
(CHEMBL3427360)
Show SMILES Oc1ccc(\C=N\N2CCC(CC2)c2ccccc2)c(O)c1
Show InChI InChI=1S/C18H20N2O2/c21-17-7-6-16(18(22)12-17)13-19-20-10-8-15(9-11-20)14-4-2-1-3-5-14/h1-7,12-13,15,21-22H,8-11H2/b19-13+
n/an/a 4.00E+4n/an/an/an/an/an/a
Graz University of Technology
Curated by ChEMBL
Assay Description
Inhibition of mouse recombinant ATGL expressed in African green monkey COS7 cells assessed as reduction in triglyceride hydrolase activity using radi...
Bioorg Med Chem 23: 2904-16 (2015)
Article DOI: 10.1016/j.bmc.2015.02.051
BindingDB Entry DOI: 10.7270/Q2086710