null
SMILES: Oc1ccc(CN2CCN(CC2)c2ccccc2)cc1O
InChI Key: InChIKey=VPERQCBGSXRUIE-UHFFFAOYSA-N
Activity Spreadsheet -- Enzyme Inhibition Constant Data from BindingDB
Found 1 hit for monomerid = 50084926
Trg + Lig
Ki
nM
ΔG°
kcal/mole
IC50
nM
Kd
nM
EC50/IC50
nM
koff
s-1
kon
M-1s-1
pHTemp
°C
Patatin-like phospholipase domain-containing protein 2
(Mus musculus)
BDBM50084926
(CHEMBL3427363)
Show SMILES Oc1ccc(CN2CCN(CC2)c2ccccc2)cc1O
Show InChI InChI=1S/C17H20N2O2/c20-16-7-6-14(12-17(16)21)13-18-8-10-19(11-9-18)15-4-2-1-3-5-15/h1-7,12,20-21H,8-11,13H2
n/an/a>2.00E+5n/an/an/an/an/an/a
Graz University of Technology
Curated by ChEMBL
Assay Description
Inhibition of mouse recombinant ATGL expressed in African green monkey COS7 cells assessed as reduction in triglyceride hydrolase activity using radi...
Bioorg Med Chem 23: 2904-16 (2015)
Article DOI: 10.1016/j.bmc.2015.02.051
BindingDB Entry DOI: 10.7270/Q2086710