BDBM50084937 CHEMBL3427376
SMILES: COC(=O)c1oc2ccc(OC)cc2c1Nc1cc(OC)c(OC)c(OC)c1
InChI Key: InChIKey=ALNFBGSYCWRDML-UHFFFAOYSA-N
Data: 1 IC50
Activity Spreadsheet -- Enzyme Inhibition Constant Data from BindingDB
Found 1 hit for monomerid = 50084937
Trg + Lig
Ki
nM
ΔG°
kcal/mole
IC50
nM
Kd
nM
EC50/IC50
nM
koff
s-1
kon
M-1s-1
pHTemp
°C
Similar to alpha-tubulin isoform 1
(Bos taurus)
BDBM50084937
(CHEMBL3427376)
Show SMILES COC(=O)c1oc2ccc(OC)cc2c1Nc1cc(OC)c(OC)c(OC)c1
Show InChI InChI=1S/C20H21NO7/c1-23-12-6-7-14-13(10-12)17(19(28-14)20(22)27-5)21-11-8-15(24-2)18(26-4)16(9-11)25-3/h6-10,21H,1-5H3
n/an/a 7.50E+3n/an/an/an/an/an/a
Universit£ di Ferrara
Curated by ChEMBL
Assay Description
Inhibition of bovine brain tubulin assembly after 20 mins incubation by spectrophotometric analysis
J Med Chem 58: 3209-22 (2015)
Article DOI: 10.1021/acs.jmedchem.5b00155
BindingDB Entry DOI: 10.7270/Q2QV3P6V