BDBM50084965 CHEMBL3427393
SMILES: OC(=O)\C=C\c1ccc(Cc2c(-c3ccc(OC(F)(F)F)cc3)c(=O)oc3cc(O)ccc23)cc1
InChI Key: InChIKey=HUSDEJUFHSWBRQ-LFYBBSHMSA-N
Data: 2 IC50
Activity Spreadsheet -- Enzyme Inhibition Constant Data from BindingDB
Found 2 hits for monomerid = 50084965
Trg + Lig
Ki
nM
ΔG°
kcal/mole
IC50
nM
Kd
nM
EC50/IC50
nM
koff
s-1
kon
M-1s-1
pHTemp
°C
Estrogen receptor
(Homo sapiens (Human))
BDBM50084965
(CHEMBL3427393)
Show SMILES OC(=O)\C=C\c1ccc(Cc2c(-c3ccc(OC(F)(F)F)cc3)c(=O)oc3cc(O)ccc23)cc1
Show InChI InChI=1S/C26H17F3O6/c27-26(28,29)35-19-9-6-17(7-10-19)24-21(20-11-8-18(30)14-22(20)34-25(24)33)13-16-3-1-15(2-4-16)5-12-23(31)32/h1-12,14,30H,13H2,(H,31,32)/b12-5+
n/an/a 52n/an/an/an/an/an/a
AstraZeneca
Curated by ChEMBL
Assay Description
Suppression of ER alpha in human MCF7 cells after 24 hrs by immunostaining analysis
J Med Chem 58: 3522-33 (2015)
Article DOI: 10.1021/acs.jmedchem.5b00066
BindingDB Entry DOI: 10.7270/Q2M32XGF
Estrogen receptor
(Homo sapiens (Human))
BDBM50084965
(CHEMBL3427393)
Show SMILES OC(=O)\C=C\c1ccc(Cc2c(-c3ccc(OC(F)(F)F)cc3)c(=O)oc3cc(O)ccc23)cc1
Show InChI InChI=1S/C26H17F3O6/c27-26(28,29)35-19-9-6-17(7-10-19)24-21(20-11-8-18(30)14-22(20)34-25(24)33)13-16-3-1-15(2-4-16)5-12-23(31)32/h1-12,14,30H,13H2,(H,31,32)/b12-5+
n/an/a 1.60n/an/an/an/an/an/a
AstraZeneca
Curated by ChEMBL
Assay Description
Binding affinity to ER alpha (unknown origin) by LanthaScreen TR-FRET competitive binding assay
J Med Chem 58: 3522-33 (2015)
Article DOI: 10.1021/acs.jmedchem.5b00066
BindingDB Entry DOI: 10.7270/Q2M32XGF