BDBM50084966 CHEMBL3427394
SMILES: OC(=O)\C=C\c1ccc(Cc2c(-c3ccc(F)cc3F)c(=O)oc3cc(O)ccc23)cc1
InChI Key: InChIKey=NINKWPYOVNOUIV-BJMVGYQFSA-N
Data: 2 IC50
Activity Spreadsheet -- Enzyme Inhibition Constant Data from BindingDB
Found 2 hits for monomerid = 50084966
Trg + Lig
Ki
nM
ΔG°
kcal/mole
IC50
nM
Kd
nM
EC50/IC50
nM
koff
s-1
kon
M-1s-1
pHTemp
°C
Estrogen receptor
(Homo sapiens (Human))
BDBM50084966
(CHEMBL3427394)
Show SMILES OC(=O)\C=C\c1ccc(Cc2c(-c3ccc(F)cc3F)c(=O)oc3cc(O)ccc23)cc1 |(-6.67,7.39,;-6.67,6.16,;-7.74,5.54,;-5.33,5.39,;-4,6.16,;-2.66,5.39,;-1.33,6.16,;0,5.39,;0,3.85,;1.33,3.08,;1.33,1.54,;2.66,.77,;4,1.54,;3.99,3.08,;5.33,3.85,;6.66,3.08,;7.73,3.7,;6.66,1.54,;5.33,.77,;5.33,-.46,;2.66,-.77,;3.73,-1.38,;1.33,-1.54,;,-.77,;-1.33,-1.54,;-2.68,-.77,;-3.75,-1.39,;-2.68,.77,;-1.33,1.54,;,.77,;-1.33,3.08,;-2.67,3.85,)|
Show InChI InChI=1S/C25H16F2O5/c26-16-6-8-19(21(27)12-16)24-20(18-9-7-17(28)13-22(18)32-25(24)31)11-15-3-1-14(2-4-15)5-10-23(29)30/h1-10,12-13,28H,11H2,(H,29,30)/b10-5+
n/an/a 660n/an/an/an/an/an/a
AstraZeneca
Curated by ChEMBL
Assay Description
Suppression of ER alpha in human MCF7 cells after 24 hrs by immunostaining analysis
J Med Chem 58: 3522-33 (2015)
Article DOI: 10.1021/acs.jmedchem.5b00066
BindingDB Entry DOI: 10.7270/Q2M32XGF
Estrogen receptor
(Homo sapiens (Human))
BDBM50084966
(CHEMBL3427394)
Show SMILES OC(=O)\C=C\c1ccc(Cc2c(-c3ccc(F)cc3F)c(=O)oc3cc(O)ccc23)cc1 |(-6.67,7.39,;-6.67,6.16,;-7.74,5.54,;-5.33,5.39,;-4,6.16,;-2.66,5.39,;-1.33,6.16,;0,5.39,;0,3.85,;1.33,3.08,;1.33,1.54,;2.66,.77,;4,1.54,;3.99,3.08,;5.33,3.85,;6.66,3.08,;7.73,3.7,;6.66,1.54,;5.33,.77,;5.33,-.46,;2.66,-.77,;3.73,-1.38,;1.33,-1.54,;,-.77,;-1.33,-1.54,;-2.68,-.77,;-3.75,-1.39,;-2.68,.77,;-1.33,1.54,;,.77,;-1.33,3.08,;-2.67,3.85,)|
Show InChI InChI=1S/C25H16F2O5/c26-16-6-8-19(21(27)12-16)24-20(18-9-7-17(28)13-22(18)32-25(24)31)11-15-3-1-14(2-4-15)5-10-23(29)30/h1-10,12-13,28H,11H2,(H,29,30)/b10-5+
n/an/a 3n/an/an/an/an/an/a
AstraZeneca
Curated by ChEMBL
Assay Description
Binding affinity to ER alpha (unknown origin) by LanthaScreen TR-FRET competitive binding assay
J Med Chem 58: 3522-33 (2015)
Article DOI: 10.1021/acs.jmedchem.5b00066
BindingDB Entry DOI: 10.7270/Q2M32XGF