BDBM50084973 CHEMBL3427401
SMILES: Cc1cc(F)ccc1-c1c(Oc2ccc(\C=C\C(O)=O)cc2)c2ccc(O)cc2oc1=O
InChI Key: InChIKey=OIMRVAOKBZRYOZ-NYYWCZLTSA-N
Data: 5 IC50
Activity Spreadsheet -- Enzyme Inhibition Constant Data from BindingDB
Found 5 hits for monomerid = 50084973
Trg + Lig
Ki
nM
ΔG°
kcal/mole
IC50
nM
Kd
nM
EC50/IC50
nM
koff
s-1
kon
M-1s-1
pHTemp
°C
Estrogen receptor
(Homo sapiens (Human))
BDBM50084973
(CHEMBL3427401)
Show SMILES Cc1cc(F)ccc1-c1c(Oc2ccc(\C=C\C(O)=O)cc2)c2ccc(O)cc2oc1=O |(-5.36,-.45,;-5.35,.78,;-6.68,1.56,;-6.67,3.1,;-7.73,3.72,;-5.33,3.86,;-4,3.08,;-4.01,1.54,;-2.68,.77,;-1.33,1.54,;-1.33,3.08,;.01,3.84,;1.34,3.07,;2.68,3.83,;2.69,5.37,;4.02,6.14,;4.03,7.68,;5.37,8.44,;6.43,7.82,;5.37,9.68,;1.36,6.15,;.02,5.38,;,.77,;1.33,1.54,;2.66,.77,;2.66,-.77,;3.73,-1.38,;1.33,-1.54,;,-.77,;-1.33,-1.54,;-2.68,-.77,;-3.75,-1.39,)|
Show InChI InChI=1S/C25H17FO6/c1-14-12-16(26)5-9-19(14)23-24(20-10-6-17(27)13-21(20)32-25(23)30)31-18-7-2-15(3-8-18)4-11-22(28)29/h2-13,27H,1H3,(H,28,29)/b11-4+
n/an/a 0.400n/an/an/an/an/an/a
AstraZeneca
Curated by ChEMBL
Assay Description
Binding affinity to ER alpha (unknown origin) by LanthaScreen TR-FRET competitive binding assay
J Med Chem 58: 3522-33 (2015)
Article DOI: 10.1021/acs.jmedchem.5b00066
BindingDB Entry DOI: 10.7270/Q2M32XGF
Potassium voltage-gated channel subfamily H member 2
(Homo sapiens (Human))
BDBM50084973
(CHEMBL3427401)
Show SMILES Cc1cc(F)ccc1-c1c(Oc2ccc(\C=C\C(O)=O)cc2)c2ccc(O)cc2oc1=O |(-5.36,-.45,;-5.35,.78,;-6.68,1.56,;-6.67,3.1,;-7.73,3.72,;-5.33,3.86,;-4,3.08,;-4.01,1.54,;-2.68,.77,;-1.33,1.54,;-1.33,3.08,;.01,3.84,;1.34,3.07,;2.68,3.83,;2.69,5.37,;4.02,6.14,;4.03,7.68,;5.37,8.44,;6.43,7.82,;5.37,9.68,;1.36,6.15,;.02,5.38,;,.77,;1.33,1.54,;2.66,.77,;2.66,-.77,;3.73,-1.38,;1.33,-1.54,;,-.77,;-1.33,-1.54,;-2.68,-.77,;-3.75,-1.39,)|
Show InChI InChI=1S/C25H17FO6/c1-14-12-16(26)5-9-19(14)23-24(20-10-6-17(27)13-21(20)32-25(23)30)31-18-7-2-15(3-8-18)4-11-22(28)29/h2-13,27H,1H3,(H,28,29)/b11-4+
Reactome pathway
n/an/a>1.00E+5n/an/an/an/an/an/a
AstraZeneca
Curated by ChEMBL
Assay Description
Inhibition of hERG channel by electrophysiology
J Med Chem 58: 3522-33 (2015)
Article DOI: 10.1021/acs.jmedchem.5b00066
BindingDB Entry DOI: 10.7270/Q2M32XGF
Estrogen receptor
(Homo sapiens (Human))
BDBM50084973
(CHEMBL3427401)
Show SMILES Cc1cc(F)ccc1-c1c(Oc2ccc(\C=C\C(O)=O)cc2)c2ccc(O)cc2oc1=O |(-5.36,-.45,;-5.35,.78,;-6.68,1.56,;-6.67,3.1,;-7.73,3.72,;-5.33,3.86,;-4,3.08,;-4.01,1.54,;-2.68,.77,;-1.33,1.54,;-1.33,3.08,;.01,3.84,;1.34,3.07,;2.68,3.83,;2.69,5.37,;4.02,6.14,;4.03,7.68,;5.37,8.44,;6.43,7.82,;5.37,9.68,;1.36,6.15,;.02,5.38,;,.77,;1.33,1.54,;2.66,.77,;2.66,-.77,;3.73,-1.38,;1.33,-1.54,;,-.77,;-1.33,-1.54,;-2.68,-.77,;-3.75,-1.39,)|
Show InChI InChI=1S/C25H17FO6/c1-14-12-16(26)5-9-19(14)23-24(20-10-6-17(27)13-21(20)32-25(23)30)31-18-7-2-15(3-8-18)4-11-22(28)29/h2-13,27H,1H3,(H,28,29)/b11-4+
n/an/a 27n/an/an/an/an/an/a
AstraZeneca
Curated by ChEMBL
Assay Description
Agonist activity at ER alpha in human MCF7 cells assessed as PR gene expression after 24 hrs by laser scanning imaging cytometer analysis
J Med Chem 58: 3522-33 (2015)
Article DOI: 10.1021/acs.jmedchem.5b00066
BindingDB Entry DOI: 10.7270/Q2M32XGF
Estrogen receptor
(Homo sapiens (Human))
BDBM50084973
(CHEMBL3427401)
Show SMILES Cc1cc(F)ccc1-c1c(Oc2ccc(\C=C\C(O)=O)cc2)c2ccc(O)cc2oc1=O |(-5.36,-.45,;-5.35,.78,;-6.68,1.56,;-6.67,3.1,;-7.73,3.72,;-5.33,3.86,;-4,3.08,;-4.01,1.54,;-2.68,.77,;-1.33,1.54,;-1.33,3.08,;.01,3.84,;1.34,3.07,;2.68,3.83,;2.69,5.37,;4.02,6.14,;4.03,7.68,;5.37,8.44,;6.43,7.82,;5.37,9.68,;1.36,6.15,;.02,5.38,;,.77,;1.33,1.54,;2.66,.77,;2.66,-.77,;3.73,-1.38,;1.33,-1.54,;,-.77,;-1.33,-1.54,;-2.68,-.77,;-3.75,-1.39,)|
Show InChI InChI=1S/C25H17FO6/c1-14-12-16(26)5-9-19(14)23-24(20-10-6-17(27)13-21(20)32-25(23)30)31-18-7-2-15(3-8-18)4-11-22(28)29/h2-13,27H,1H3,(H,28,29)/b11-4+
n/an/a 27n/an/an/an/an/an/a
AstraZeneca
Curated by ChEMBL
Assay Description
Antagonist activity at ER alpha in human MCF7 cells assessed as inhibition of estradiol-induced PR expression treated for 24 hrs after incubation wit...
J Med Chem 58: 3522-33 (2015)
Article DOI: 10.1021/acs.jmedchem.5b00066
BindingDB Entry DOI: 10.7270/Q2M32XGF
Estrogen receptor
(Homo sapiens (Human))
BDBM50084973
(CHEMBL3427401)
Show SMILES Cc1cc(F)ccc1-c1c(Oc2ccc(\C=C\C(O)=O)cc2)c2ccc(O)cc2oc1=O |(-5.36,-.45,;-5.35,.78,;-6.68,1.56,;-6.67,3.1,;-7.73,3.72,;-5.33,3.86,;-4,3.08,;-4.01,1.54,;-2.68,.77,;-1.33,1.54,;-1.33,3.08,;.01,3.84,;1.34,3.07,;2.68,3.83,;2.69,5.37,;4.02,6.14,;4.03,7.68,;5.37,8.44,;6.43,7.82,;5.37,9.68,;1.36,6.15,;.02,5.38,;,.77,;1.33,1.54,;2.66,.77,;2.66,-.77,;3.73,-1.38,;1.33,-1.54,;,-.77,;-1.33,-1.54,;-2.68,-.77,;-3.75,-1.39,)|
Show InChI InChI=1S/C25H17FO6/c1-14-12-16(26)5-9-19(14)23-24(20-10-6-17(27)13-21(20)32-25(23)30)31-18-7-2-15(3-8-18)4-11-22(28)29/h2-13,27H,1H3,(H,28,29)/b11-4+
n/an/a 21n/an/an/an/an/an/a
AstraZeneca
Curated by ChEMBL
Assay Description
Suppression of ER alpha in human MCF7 cells after 24 hrs by immunostaining analysis
J Med Chem 58: 3522-33 (2015)
Article DOI: 10.1021/acs.jmedchem.5b00066
BindingDB Entry DOI: 10.7270/Q2M32XGF