BDBM50084983 (S)-2-[2-Amino-3-(4-hydroxy-2,6-dimethyl-phenyl)-propionyl]-7-methoxy-6-(4-methoxy-phenyl)-1,2,3,4-tetrahydro-isoquinoline-3-carboxylic acid::CHEMBL45842
SMILES: COc1ccc(cc1)-c1cc2C[C@H](N(Cc2cc1OC)C(=O)C(N)Cc1c(C)cc(O)cc1C)C(O)=O
InChI Key: InChIKey=OJPCPUPFXXXFDC-AMVUTOCUSA-N
Data: 3 IC50
Activity Spreadsheet -- Enzyme Inhibition Constant Data from BindingDB
Found 3 hits for monomerid = 50084983
Trg + Lig
Ki
nM
ΔG°
kcal/mole
IC50
nM
Kd
nM
EC50/IC50
nM
koff
s-1
kon
M-1s-1
pHTemp
°C
Delta-type opioid receptor
(Homo sapiens (Human))
BDBM50084983
((S)-2-[2-Amino-3-(4-hydroxy-2,6-dimethyl-phenyl)-p...)
Show SMILES COc1ccc(cc1)-c1cc2C[C@H](N(Cc2cc1OC)C(=O)C(N)Cc1c(C)cc(O)cc1C)C(O)=O
Show InChI InChI=1S/C29H32N2O6/c1-16-9-21(32)10-17(2)23(16)14-25(30)28(33)31-15-20-13-27(37-4)24(11-19(20)12-26(31)29(34)35)18-5-7-22(36-3)8-6-18/h5-11,13,25-26,32H,12,14-15,30H2,1-4H3,(H,34,35)/t25?,26-/m0/s1
Reactome pathway
n/an/a 1.52E+3n/an/an/an/an/an/a
AstraZeneca R&D Montréal
Curated by ChEMBL
Assay Description
Compound was evaluated for binding affinity towards Opioid receptor delta 1 by displacing 125 I-deltorphin II
Bioorg Med Chem Lett 10: 167-70 (2000)
BindingDB Entry DOI: 10.7270/Q2RV0MXM
Kappa-type opioid receptor
(Homo sapiens (Human))
BDBM50084983
((S)-2-[2-Amino-3-(4-hydroxy-2,6-dimethyl-phenyl)-p...)
Show SMILES COc1ccc(cc1)-c1cc2C[C@H](N(Cc2cc1OC)C(=O)C(N)Cc1c(C)cc(O)cc1C)C(O)=O
Show InChI InChI=1S/C29H32N2O6/c1-16-9-21(32)10-17(2)23(16)14-25(30)28(33)31-15-20-13-27(37-4)24(11-19(20)12-26(31)29(34)35)18-5-7-22(36-3)8-6-18/h5-11,13,25-26,32H,12,14-15,30H2,1-4H3,(H,34,35)/t25?,26-/m0/s1
Reactome pathway
n/an/a>1.00E+4n/an/an/an/an/an/a
AstraZeneca R&D Montréal
Curated by ChEMBL
Assay Description
Compound was evaluated for binding affinity towards Opioid receptor kappa 1 by displacing 125 I-DPDYN
Bioorg Med Chem Lett 10: 167-70 (2000)
BindingDB Entry DOI: 10.7270/Q2RV0MXM
Mu-type opioid receptor
(Homo sapiens (Human))
BDBM50084983
((S)-2-[2-Amino-3-(4-hydroxy-2,6-dimethyl-phenyl)-p...)
Show SMILES COc1ccc(cc1)-c1cc2C[C@H](N(Cc2cc1OC)C(=O)C(N)Cc1c(C)cc(O)cc1C)C(O)=O
Show InChI InChI=1S/C29H32N2O6/c1-16-9-21(32)10-17(2)23(16)14-25(30)28(33)31-15-20-13-27(37-4)24(11-19(20)12-26(31)29(34)35)18-5-7-22(36-3)8-6-18/h5-11,13,25-26,32H,12,14-15,30H2,1-4H3,(H,34,35)/t25?,26-/m0/s1
NCI pathway
Reactome pathway
n/an/a 4.64E+3n/an/an/an/an/an/a
AstraZeneca R&D Montréal
Curated by ChEMBL
Assay Description
Compound was evaluated for binding affinity towards Opioid receptor mu 1 by displacing 125 I-FK-33824
Bioorg Med Chem Lett 10: 167-70 (2000)
BindingDB Entry DOI: 10.7270/Q2RV0MXM