BDBM50085461 (S)-2-{(S)-2-[2-Benzyl-3-(formyl-hydroxy-amino)-propionylamino]-4-methyl-pentanoylamino}-3-phenyl-propionic acid::CHEMBL314626
SMILES: CC(C)C[C@H](NC(=O)C(CN(O)C=O)Cc1ccccc1)C(=O)N[C@@H](Cc1ccccc1)C(O)=O
InChI Key: InChIKey=NOJHFIBABLMWLY-KXNJDZORSA-N
Data: 2 IC50
Activity Spreadsheet -- Enzyme Inhibition Constant Data from BindingDB
Found 2 hits for monomerid = 50085461
Trg + Lig
Ki
nM
ΔG°
kcal/mole
IC50
nM
Kd
nM
EC50/IC50
nM
koff
s-1
kon
M-1s-1
pHTemp
°C
Neutral Endopeptidase (NEP)
(Rattus norvegicus (Rat))
BDBM50085461
((S)-2-{(S)-2-[2-Benzyl-3-(formyl-hydroxy-amino)-pr...)
Show SMILES CC(C)C[C@H](NC(=O)C(CN(O)C=O)Cc1ccccc1)C(=O)N[C@@H](Cc1ccccc1)C(O)=O
Show InChI InChI=1S/C26H33N3O6/c1-18(2)13-22(25(32)28-23(26(33)34)15-20-11-7-4-8-12-20)27-24(31)21(16-29(35)17-30)14-19-9-5-3-6-10-19/h3-12,17-18,21-23,35H,13-16H2,1-2H3,(H,27,31)(H,28,32)(H,33,34)/t21?,22-,23-/m0/s1
Reactome pathway
n/an/a 1.27E+3n/an/an/an/an/an/a
Bristol-Myers Squibb Pharmaceutical Research Institute
Curated by ChEMBL
Assay Description
Inhibition of Neutral endopeptidase
Bioorg Med Chem Lett 10: 257-60 (2000)
BindingDB Entry DOI: 10.7270/Q2BK1BJ8
Angiotensin-converting enzyme
(Oryctolagus cuniculus)
BDBM50085461
((S)-2-{(S)-2-[2-Benzyl-3-(formyl-hydroxy-amino)-pr...)
Show SMILES CC(C)C[C@H](NC(=O)C(CN(O)C=O)Cc1ccccc1)C(=O)N[C@@H](Cc1ccccc1)C(O)=O
Show InChI InChI=1S/C26H33N3O6/c1-18(2)13-22(25(32)28-23(26(33)34)15-20-11-7-4-8-12-20)27-24(31)21(16-29(35)17-30)14-19-9-5-3-6-10-19/h3-12,17-18,21-23,35H,13-16H2,1-2H3,(H,27,31)(H,28,32)(H,33,34)/t21?,22-,23-/m0/s1
n/an/a 106n/an/an/an/an/an/a
Bristol-Myers Squibb Pharmaceutical Research Institute
Curated by ChEMBL
Assay Description
Inhibition of Angiotensin I converting enzyme
Bioorg Med Chem Lett 10: 257-60 (2000)
BindingDB Entry DOI: 10.7270/Q2BK1BJ8