BDBM50085912 7-{2-[4-(3-Chloro-phenylsulfanyl)-3-hydroxy-butyl]-3,5-dihydroxy-cyclopentyl}-heptanoic acid::CHEMBL173680
SMILES: OC(CC[C@H]1[C@H](O)C[C@H](O)[C@@H]1CCCCCCC(O)=O)CSc1cccc(Cl)c1
InChI Key: InChIKey=PBLCPPVPUGIVDL-HOPUUNBDSA-N
Data: 8 IC50
Activity Spreadsheet -- Enzyme Inhibition Constant Data from BindingDB
Found 8 hits for monomerid = 50085912
Trg + Lig
Ki
nM
ΔG°
kcal/mole
IC50
nM
Kd
nM
EC50/IC50
nM
koff
s-1
kon
M-1s-1
pHTemp
°C
Prostaglandin E2 receptor EP2 subtype
(Homo sapiens (Human))
BDBM50085912
(7-{2-[4-(3-Chloro-phenylsulfanyl)-3-hydroxy-butyl]...)
Show SMILES OC(CC[C@H]1[C@H](O)C[C@H](O)[C@@H]1CCCCCCC(O)=O)CSc1cccc(Cl)c1
Show InChI InChI=1S/C22H33ClO5S/c23-15-6-5-7-17(12-15)29-14-16(24)10-11-19-18(20(25)13-21(19)26)8-3-1-2-4-9-22(27)28/h5-7,12,16,18-21,24-26H,1-4,8-11,13-14H2,(H,27,28)/t16?,18-,19-,20+,21-/m1/s1
Reactome pathway
n/an/a 2.40E+3n/an/an/an/an/an/a
Procter and Gamble Pharmaceuticals
Curated by ChEMBL
Assay Description
Affinity for Prostanoid EP2 receptor expressed in CHO cells
J Med Chem 43: 945-52 (2000)
BindingDB Entry DOI: 10.7270/Q2MW2GCN
Prostanoid TP receptor
(Homo sapiens (Human))
BDBM50085912
(7-{2-[4-(3-Chloro-phenylsulfanyl)-3-hydroxy-butyl]...)
Show SMILES OC(CC[C@H]1[C@H](O)C[C@H](O)[C@@H]1CCCCCCC(O)=O)CSc1cccc(Cl)c1
Show InChI InChI=1S/C22H33ClO5S/c23-15-6-5-7-17(12-15)29-14-16(24)10-11-19-18(20(25)13-21(19)26)8-3-1-2-4-9-22(27)28/h5-7,12,16,18-21,24-26H,1-4,8-11,13-14H2,(H,27,28)/t16?,18-,19-,20+,21-/m1/s1
n/an/a>1.00E+4n/an/an/an/an/an/a
Procter and Gamble Pharmaceuticals
Curated by ChEMBL
Assay Description
Affinity for Prostanoid TP receptor expressed in CHO cells
J Med Chem 43: 945-52 (2000)
BindingDB Entry DOI: 10.7270/Q2MW2GCN
Prostanoid IP receptor
(Homo sapiens (Human))
BDBM50085912
(7-{2-[4-(3-Chloro-phenylsulfanyl)-3-hydroxy-butyl]...)
Show SMILES OC(CC[C@H]1[C@H](O)C[C@H](O)[C@@H]1CCCCCCC(O)=O)CSc1cccc(Cl)c1
Show InChI InChI=1S/C22H33ClO5S/c23-15-6-5-7-17(12-15)29-14-16(24)10-11-19-18(20(25)13-21(19)26)8-3-1-2-4-9-22(27)28/h5-7,12,16,18-21,24-26H,1-4,8-11,13-14H2,(H,27,28)/t16?,18-,19-,20+,21-/m1/s1
NCI pathway
Reactome pathway
n/an/a>1.00E+4n/an/an/an/an/an/a
Procter and Gamble Pharmaceuticals
Curated by ChEMBL
Assay Description
Affinity for Prostaglandin I2 receptor expressed in CHO cells
J Med Chem 43: 945-52 (2000)
BindingDB Entry DOI: 10.7270/Q2MW2GCN
Prostaglandin E2 receptor EP1 subtype (EP1)
(Homo sapiens (Human))
BDBM50085912
(7-{2-[4-(3-Chloro-phenylsulfanyl)-3-hydroxy-butyl]...)
Show SMILES OC(CC[C@H]1[C@H](O)C[C@H](O)[C@@H]1CCCCCCC(O)=O)CSc1cccc(Cl)c1
Show InChI InChI=1S/C22H33ClO5S/c23-15-6-5-7-17(12-15)29-14-16(24)10-11-19-18(20(25)13-21(19)26)8-3-1-2-4-9-22(27)28/h5-7,12,16,18-21,24-26H,1-4,8-11,13-14H2,(H,27,28)/t16?,18-,19-,20+,21-/m1/s1
n/an/a>1.00E+4n/an/an/an/an/an/a
Procter and Gamble Pharmaceuticals
Curated by ChEMBL
Assay Description
Affinity for Prostanoid EP1 receptor expressed in COS-7 cells.
J Med Chem 43: 945-52 (2000)
BindingDB Entry DOI: 10.7270/Q2MW2GCN
Prostaglandin E2 receptor EP4 subtype
(Homo sapiens (Human))
BDBM50085912
(7-{2-[4-(3-Chloro-phenylsulfanyl)-3-hydroxy-butyl]...)
Show SMILES OC(CC[C@H]1[C@H](O)C[C@H](O)[C@@H]1CCCCCCC(O)=O)CSc1cccc(Cl)c1
Show InChI InChI=1S/C22H33ClO5S/c23-15-6-5-7-17(12-15)29-14-16(24)10-11-19-18(20(25)13-21(19)26)8-3-1-2-4-9-22(27)28/h5-7,12,16,18-21,24-26H,1-4,8-11,13-14H2,(H,27,28)/t16?,18-,19-,20+,21-/m1/s1
Reactome pathway
n/an/a>1.00E+4n/an/an/an/an/an/a
Procter and Gamble Pharmaceuticals
Curated by ChEMBL
Assay Description
Affinity for Prostanoid EP4 receptor expressed in CHO cells
J Med Chem 43: 945-52 (2000)
BindingDB Entry DOI: 10.7270/Q2MW2GCN
Prostaglandin F2-alpha receptor
(Homo sapiens (Human))
BDBM50085912
(7-{2-[4-(3-Chloro-phenylsulfanyl)-3-hydroxy-butyl]...)
Show SMILES OC(CC[C@H]1[C@H](O)C[C@H](O)[C@@H]1CCCCCCC(O)=O)CSc1cccc(Cl)c1
Show InChI InChI=1S/C22H33ClO5S/c23-15-6-5-7-17(12-15)29-14-16(24)10-11-19-18(20(25)13-21(19)26)8-3-1-2-4-9-22(27)28/h5-7,12,16,18-21,24-26H,1-4,8-11,13-14H2,(H,27,28)/t16?,18-,19-,20+,21-/m1/s1
n/an/a 17n/an/an/an/an/an/a
Procter and Gamble Pharmaceuticals
Curated by ChEMBL
Assay Description
Affinity for human Prostanoid FP receptor expressed in COS-7 cells
J Med Chem 43: 945-52 (2000)
BindingDB Entry DOI: 10.7270/Q2MW2GCN
Prostanoid DP receptor
(Homo sapiens (Human))
BDBM50085912
(7-{2-[4-(3-Chloro-phenylsulfanyl)-3-hydroxy-butyl]...)
Show SMILES OC(CC[C@H]1[C@H](O)C[C@H](O)[C@@H]1CCCCCCC(O)=O)CSc1cccc(Cl)c1
Show InChI InChI=1S/C22H33ClO5S/c23-15-6-5-7-17(12-15)29-14-16(24)10-11-19-18(20(25)13-21(19)26)8-3-1-2-4-9-22(27)28/h5-7,12,16,18-21,24-26H,1-4,8-11,13-14H2,(H,27,28)/t16?,18-,19-,20+,21-/m1/s1
n/an/a>1.00E+4n/an/an/an/an/an/a
Procter and Gamble Pharmaceuticals
Curated by ChEMBL
Assay Description
Affinity for human Prostaglandin D2 receptor expressed in HEK-293 cells
J Med Chem 43: 945-52 (2000)
BindingDB Entry DOI: 10.7270/Q2MW2GCN
Prostaglandin E2 receptor
(Homo sapiens (Human))
BDBM50085912
(7-{2-[4-(3-Chloro-phenylsulfanyl)-3-hydroxy-butyl]...)
Show SMILES OC(CC[C@H]1[C@H](O)C[C@H](O)[C@@H]1CCCCCCC(O)=O)CSc1cccc(Cl)c1
Show InChI InChI=1S/C22H33ClO5S/c23-15-6-5-7-17(12-15)29-14-16(24)10-11-19-18(20(25)13-21(19)26)8-3-1-2-4-9-22(27)28/h5-7,12,16,18-21,24-26H,1-4,8-11,13-14H2,(H,27,28)/t16?,18-,19-,20+,21-/m1/s1
n/an/a>1.00E+4n/an/an/an/an/an/a
Procter and Gamble Pharmaceuticals
Curated by ChEMBL
Assay Description
Affinity for Prostanoid EP3 receptor expressed in CHO cell line
J Med Chem 43: 945-52 (2000)
BindingDB Entry DOI: 10.7270/Q2MW2GCN