BDBM50086144 4-(cyclopentylamino)-2-m-tolyl-[1,2,4]triazolo[4,3-a]quinoxalin-1(2H)-one::4-Cyclopentylamino-2-m-tolyl-2H-[1,2,4]triazolo[4,3-a]quinoxalin-1-one::CHEMBL276321
SMILES: Cc1cccc(c1)-n1nc2c(NC3CCCC3)nc3ccccc3n2c1=O
InChI Key: InChIKey=WITWYNVZVUALQW-UHFFFAOYSA-N
Data: 3 KI
Activity Spreadsheet -- Enzyme Inhibition Constant Data from BindingDB
Found 3 hits for monomerid = 50086144
Trg + Lig
Ki
nM
ΔG°
kcal/mole
IC50
nM
Kd
nM
EC50/IC50
nM
koff
s-1
kon
M-1s-1
pHTemp
°C
Adenosine A1 receptor
(BOVINE)
BDBM50086144
(4-(cyclopentylamino)-2-m-tolyl-[1,2,4]triazolo[4,3...)
Show SMILES Cc1cccc(c1)-n1nc2c(NC3CCCC3)nc3ccccc3n2c1=O
Show InChI InChI=1S/C21H21N5O/c1-14-7-6-10-16(13-14)26-21(27)25-18-12-5-4-11-17(18)23-19(20(25)24-26)22-15-8-2-3-9-15/h4-7,10-13,15H,2-3,8-9H2,1H3,(H,22,23)
Reactome pathway
1.21n/an/an/an/an/an/an/an/a
Universita' di Firenze
Curated by ChEMBL
Assay Description
Binding affinity towards adenosine A1 receptor of bovine brain membrane in presence of [3H]-CHA at a concentration of 20 uM
J Med Chem 43: 1158-64 (2000)
BindingDB Entry DOI: 10.7270/Q2QR4WBG
Adenosine receptor A3
(Homo sapiens (Human))
BDBM50086144
(4-(cyclopentylamino)-2-m-tolyl-[1,2,4]triazolo[4,3...)
Show SMILES Cc1cccc(c1)-n1nc2c(NC3CCCC3)nc3ccccc3n2c1=O
Show InChI InChI=1S/C21H21N5O/c1-14-7-6-10-16(13-14)26-21(27)25-18-12-5-4-11-17(18)23-19(20(25)24-26)22-15-8-2-3-9-15/h4-7,10-13,15H,2-3,8-9H2,1H3,(H,22,23)
Reactome pathway
27.5n/an/an/an/an/an/an/an/a
National University of Singapore
Curated by ChEMBL
Assay Description
Antagonist activity at human adenosine A3 receptor
Bioorg Med Chem Lett 21: 2898-905 (2011)
Article DOI: 10.1016/j.bmcl.2011.03.073
BindingDB Entry DOI: 10.7270/Q2VH5P5Z
Adenosine receptor A3
(Homo sapiens (Human))
BDBM50086144
(4-(cyclopentylamino)-2-m-tolyl-[1,2,4]triazolo[4,3...)
Show SMILES Cc1cccc(c1)-n1nc2c(NC3CCCC3)nc3ccccc3n2c1=O
Show InChI InChI=1S/C21H21N5O/c1-14-7-6-10-16(13-14)26-21(27)25-18-12-5-4-11-17(18)23-19(20(25)24-26)22-15-8-2-3-9-15/h4-7,10-13,15H,2-3,8-9H2,1H3,(H,22,23)
Reactome pathway
27.5n/an/an/an/an/an/an/an/a
Universita' di Firenze
Curated by ChEMBL
Assay Description
Binding affinity towards human adenosine A3 receptor expressed in HEK-293 cells in presence of [125I]-AB-MECA at a concentration of 1 uM
J Med Chem 43: 1158-64 (2000)
BindingDB Entry DOI: 10.7270/Q2QR4WBG