BDBM50086149 CHEMBL280080::N-(1-Oxo-2-phenyl-1,2-dihydro-[1,2,4]triazolo[4,3-a]quinoxalin-4-yl)-2-phenyl-acetamide
SMILES: O=C(Cc1ccccc1)Nc1nc2ccccc2n2c1nn(-c1ccccc1)c2=O
InChI Key: InChIKey=FDNUKFIVCORAHJ-UHFFFAOYSA-N
Data: 3 KI
Activity Spreadsheet -- Enzyme Inhibition Constant Data from BindingDB
Found 3 hits for monomerid = 50086149
Trg + Lig
Ki
nM
ΔG°
kcal/mole
IC50
nM
Kd
nM
EC50/IC50
nM
koff
s-1
kon
M-1s-1
pHTemp
°C
Adenosine receptor A3
(Homo sapiens (Human))
BDBM50086149
(CHEMBL280080 | N-(1-Oxo-2-phenyl-1,2-dihydro-[1,2,...)
Show SMILES O=C(Cc1ccccc1)Nc1nc2ccccc2n2c1nn(-c1ccccc1)c2=O
Show InChI InChI=1S/C23H17N5O2/c29-20(15-16-9-3-1-4-10-16)25-21-22-26-28(17-11-5-2-6-12-17)23(30)27(22)19-14-8-7-13-18(19)24-21/h1-14H,15H2,(H,24,25,29)
Reactome pathway
3.75n/an/an/an/an/an/an/an/a
Universita' di Firenze
Curated by ChEMBL
Assay Description
Binding affinity towards human adenosine A3 receptor expressed in HEK-293 cells in presence of [125I]-AB-MECA at a concentration of 1 uM
J Med Chem 43: 1158-64 (2000)
BindingDB Entry DOI: 10.7270/Q2QR4WBG
Adenosine receptor A3
(Homo sapiens (Human))
BDBM50086149
(CHEMBL280080 | N-(1-Oxo-2-phenyl-1,2-dihydro-[1,2,...)
Show SMILES O=C(Cc1ccccc1)Nc1nc2ccccc2n2c1nn(-c1ccccc1)c2=O
Show InChI InChI=1S/C23H17N5O2/c29-20(15-16-9-3-1-4-10-16)25-21-22-26-28(17-11-5-2-6-12-17)23(30)27(22)19-14-8-7-13-18(19)24-21/h1-14H,15H2,(H,24,25,29)
Reactome pathway
3.75n/an/an/an/an/an/an/an/a
National University of Singapore
Curated by ChEMBL
Assay Description
Antagonist activity at human adenosine A3 receptor
Bioorg Med Chem Lett 21: 2898-905 (2011)
Article DOI: 10.1016/j.bmcl.2011.03.073
BindingDB Entry DOI: 10.7270/Q2VH5P5Z
Adenosine A1 receptor
(BOVINE)
BDBM50086149
(CHEMBL280080 | N-(1-Oxo-2-phenyl-1,2-dihydro-[1,2,...)
Show SMILES O=C(Cc1ccccc1)Nc1nc2ccccc2n2c1nn(-c1ccccc1)c2=O
Show InChI InChI=1S/C23H17N5O2/c29-20(15-16-9-3-1-4-10-16)25-21-22-26-28(17-11-5-2-6-12-17)23(30)27(22)19-14-8-7-13-18(19)24-21/h1-14H,15H2,(H,24,25,29)
Reactome pathway
6.30n/an/an/an/an/an/an/an/a
Universita' di Firenze
Curated by ChEMBL
Assay Description
Binding affinity towards adenosine A1 receptor of bovine brain membrane in presence of [3H]-CHA at a concentration of 20 uM
J Med Chem 43: 1158-64 (2000)
BindingDB Entry DOI: 10.7270/Q2QR4WBG