BDBM50086222 CHEMBL3425732
SMILES: OCc1cc(=O)c(O)cn1-c1ccc(cc1)-c1ccccc1
InChI Key: InChIKey=OMNLVVBCKXMPHK-UHFFFAOYSA-N
Data: 1 IC50
Activity Spreadsheet -- Enzyme Inhibition Constant Data from BindingDB
Found 1 hit for monomerid = 50086222
Trg + Lig
Ki
nM
ΔG°
kcal/mole
IC50
nM
Kd
nM
EC50/IC50
nM
koff
s-1
kon
M-1s-1
pHTemp
°C
Catechol O-methyltransferase (MB-COMT)
(Homo sapiens (Human))
BDBM50086222
(CHEMBL3425732)
Show SMILES OCc1cc(=O)c(O)cn1-c1ccc(cc1)-c1ccccc1
Show InChI InChI=1S/C18H15NO3/c20-12-16-10-17(21)18(22)11-19(16)15-8-6-14(7-9-15)13-4-2-1-3-5-13/h1-11,20,22H,12H2
n/an/a 140n/an/an/an/an/an/a
Merck Research Laboratories
Curated by ChEMBL
Assay Description
Inhibition of C-terminal His6-tagged recombinant human membrane bound COMT expressed in Bacmid infected Sf-9 insect cells using dopamine/SAM as subst...
ACS Med Chem Lett 6: 318-23 (2015)
Article DOI: 10.1021/ml500502d
BindingDB Entry DOI: 10.7270/Q2K35WDZ