BDBM50086248 CHEMBL3425756
SMILES: CCNc1nc(Cc2ccccc2)cc2CCNCCc12
InChI Key: InChIKey=ONTAWQDMHIOMGP-UHFFFAOYSA-N
Data: 1 KI  2 EC50
Activity Spreadsheet -- Enzyme Inhibition Constant Data from BindingDB
Found 3 hits for monomerid = 50086248
Trg + Lig
Ki
nM
ΔG°
kcal/mole
IC50
nM
Kd
nM
EC50/IC50
nM
koff
s-1
kon
M-1s-1
pHTemp
°C
5-hydroxytryptamine receptor 2C
(Homo sapiens (Human))
BDBM50086248
(CHEMBL3425756)
Show SMILES CCNc1nc(Cc2ccccc2)cc2CCNCCc12
Show InChI InChI=1S/C18H23N3/c1-2-20-18-17-9-11-19-10-8-15(17)13-16(21-18)12-14-6-4-3-5-7-14/h3-7,13,19H,2,8-12H2,1H3,(H,20,21)
Reactome pathway
3n/an/an/an/an/an/an/an/a
University of Cambridge
Curated by ChEMBL
Assay Description
Inhibition of Cy3B conjugated serotonin analogue binding to human recombinant 5-HT2C receptor expressed in Swiss mouse 3T3 cell membranes after 60 mi...
ACS Med Chem Lett 6: 329-33 (2015)
Article DOI: 10.1021/ml500507v
BindingDB Entry DOI: 10.7270/Q29K4CZW
5-hydroxytryptamine receptor 2B
(Homo sapiens (Human))
BDBM50086248
(CHEMBL3425756)
Show SMILES CCNc1nc(Cc2ccccc2)cc2CCNCCc12
Show InChI InChI=1S/C18H23N3/c1-2-20-18-17-9-11-19-10-8-15(17)13-16(21-18)12-14-6-4-3-5-7-14/h3-7,13,19H,2,8-12H2,1H3,(H,20,21)
Reactome pathway
n/an/an/an/a 18n/an/an/an/a
University of Cambridge
Curated by ChEMBL
Assay Description
Agonist activity at human recombinant 5-HT2B receptor expressed in CHOK1 cells assessed as induction of Ca2+ mobilization after 1 hr by FLIPR assay
ACS Med Chem Lett 6: 329-33 (2015)
Article DOI: 10.1021/ml500507v
BindingDB Entry DOI: 10.7270/Q29K4CZW
5-hydroxytryptamine receptor 2C
(Homo sapiens (Human))
BDBM50086248
(CHEMBL3425756)
Show SMILES CCNc1nc(Cc2ccccc2)cc2CCNCCc12
Show InChI InChI=1S/C18H23N3/c1-2-20-18-17-9-11-19-10-8-15(17)13-16(21-18)12-14-6-4-3-5-7-14/h3-7,13,19H,2,8-12H2,1H3,(H,20,21)
Reactome pathway
n/an/an/an/a 11n/an/an/an/a
University of Cambridge
Curated by ChEMBL
Assay Description
Agonist activity at human recombinant 5-HT2C receptor expressed in Swiss mouse 3T3 cell membranes after 30 to 40 mins by GTPgammaS recruitment assay
ACS Med Chem Lett 6: 329-33 (2015)
Article DOI: 10.1021/ml500507v
BindingDB Entry DOI: 10.7270/Q29K4CZW