BDBM50086265 CHEMBL3425863
SMILES: COc1cc(OC)cc(c1)-c1cnc2c(snc2c1)N1CCOCC1
InChI Key: InChIKey=WSIJGGUUIVGEEW-UHFFFAOYSA-N
Data: 1 Kd
Activity Spreadsheet -- Enzyme Inhibition Constant Data from BindingDB
Found 1 hit for monomerid = 50086265
Trg + Lig
Ki
nM
ΔG°
kcal/mole
IC50
nM
Kd
nM
EC50/IC50
nM
koff
s-1
kon
M-1s-1
pHTemp
°C
Serine/threonine-protein kinase GAK
(Homo sapiens (Human))
BDBM50086265
(CHEMBL3425863)
Show SMILES COc1cc(OC)cc(c1)-c1cnc2c(snc2c1)N1CCOCC1
Show InChI InChI=1S/C18H19N3O3S/c1-22-14-7-12(8-15(10-14)23-2)13-9-16-17(19-11-13)18(25-20-16)21-3-5-24-6-4-21/h7-11H,3-6H2,1-2H3
Reactome pathway
n/an/an/a 72n/an/an/an/an/a
KU Leuven
Curated by ChEMBL
Assay Description
Binding affinity to human GAK fused to T7 bacteriophage expressed in Escherichia coli BL21 after 1 hr by qPCR analysis
J Med Chem 58: 3393-410 (2015)
Article DOI: 10.1021/jm501759m
BindingDB Entry DOI: 10.7270/Q2XD13D4