BDBM50086271 CHEMBL3425870
SMILES: COCCNc1snc2cc(cnc12)-c1ccc(OC)c(OC)c1
InChI Key: InChIKey=GRIGAUNBWMSASJ-UHFFFAOYSA-N
Data: 1 Kd
Activity Spreadsheet -- Enzyme Inhibition Constant Data from BindingDB
Found 1 hit for monomerid = 50086271
Trg + Lig
Ki
nM
ΔG°
kcal/mole
IC50
nM
Kd
nM
EC50/IC50
nM
koff
s-1
kon
M-1s-1
pHTemp
°C
Serine/threonine-protein kinase GAK
(Homo sapiens (Human))
BDBM50086271
(CHEMBL3425870)
Show SMILES COCCNc1snc2cc(cnc12)-c1ccc(OC)c(OC)c1
Show InChI InChI=1S/C17H19N3O3S/c1-21-7-6-18-17-16-13(20-24-17)8-12(10-19-16)11-4-5-14(22-2)15(9-11)23-3/h4-5,8-10,18H,6-7H2,1-3H3
Reactome pathway
n/an/an/a 140n/an/an/an/an/a
KU Leuven
Curated by ChEMBL
Assay Description
Binding affinity to human GAK fused to T7 bacteriophage expressed in Escherichia coli BL21 after 1 hr by qPCR analysis
J Med Chem 58: 3393-410 (2015)
Article DOI: 10.1021/jm501759m
BindingDB Entry DOI: 10.7270/Q2XD13D4