BDBM50086406 CHEMBL3426084
SMILES: NC(=O)c1ccc(Nc2ncnc3ccc(cc23)-c2cncs2)cc1
InChI Key: InChIKey=SBFSSKKJPPYCSR-UHFFFAOYSA-N
Data: 2 IC50
Activity Spreadsheet -- Enzyme Inhibition Constant Data from BindingDB
Found 2 hits for monomerid = 50086406
Trg + Lig
Ki
nM
ΔG°
kcal/mole
IC50
nM
Kd
nM
EC50/IC50
nM
koff
s-1
kon
M-1s-1
pHTemp
°C
Lymphocyte differentiation antigen CD38
(Homo sapiens (Human))
BDBM50086406
(CHEMBL3426084)
Show SMILES NC(=O)c1ccc(Nc2ncnc3ccc(cc23)-c2cncs2)cc1
Show InChI InChI=1S/C18H13N5OS/c19-17(24)11-1-4-13(5-2-11)23-18-14-7-12(16-8-20-10-25-16)3-6-15(14)21-9-22-18/h1-10H,(H2,19,24)(H,21,22,23)
n/an/a 560n/an/an/an/an/an/a
GlaxoSmithKline
Curated by ChEMBL
Assay Description
Inhibition of human CD38 extracellular domain expressed in Pichia pastoris assessed as NAD hydrolysis by colorimetric-based assay
J Med Chem 58: 3548-71 (2015)
Article DOI: 10.1021/jm502009h
BindingDB Entry DOI: 10.7270/Q2NV9M00
ADP-ribosyl cyclase/cyclic ADP-ribose hydrolase 1
(Mus musculus)
BDBM50086406
(CHEMBL3426084)
Show SMILES NC(=O)c1ccc(Nc2ncnc3ccc(cc23)-c2cncs2)cc1
Show InChI InChI=1S/C18H13N5OS/c19-17(24)11-1-4-13(5-2-11)23-18-14-7-12(16-8-20-10-25-16)3-6-15(14)21-9-22-18/h1-10H,(H2,19,24)(H,21,22,23)
n/an/a 24n/an/an/an/an/an/a
GlaxoSmithKline
Curated by ChEMBL
Assay Description
Inhibition of mouse recombinant CD38 extracellular domain expressed in CHO CGE cells assessed as NAD hydrolysis by fluorescence plate reader analysis
J Med Chem 58: 3548-71 (2015)
Article DOI: 10.1021/jm502009h
BindingDB Entry DOI: 10.7270/Q2NV9M00