BDBM50086592 CHEMBL3426247
SMILES: CCc1cc(OC)ccc1-c1ccc(C[C@H](NC(=O)[C@H](CC(O)=O)NC(=O)[C@H](CO)NC(=O)[C@@H](NC(=O)[C@](C)(Cc2ccccc2F)NC(=O)[C@@H]2CSSC[C@H](NC(=O)[C@@H](N)Cc3cnc[nH]3)C(=O)N[C@@H](CCC(O)=O)C(=O)NCC(=O)N2)[C@@H](C)O)C(=O)N[C@@H](CCCc2ccccc2)C(N)=O)cc1
InChI Key:
Data: 1 KI  1 EC50
Activity Spreadsheet -- Enzyme Inhibition Constant Data from BindingDB
Found 2 hits for monomerid = 50086592
Trg + Lig
Ki
nM
ΔG°
kcal/mole
IC50
nM
Kd
nM
EC50/IC50
nM
koff
s-1
kon
M-1s-1
pHTemp
°C
Glucagon-like peptide 1 receptor (GLP-1)
(Homo sapiens (Human))
BDBM50086592
(CHEMBL3426247)
Show SMILES CCc1cc(OC)ccc1-c1ccc(C[C@H](NC(=O)[C@H](CC(O)=O)NC(=O)[C@H](CO)NC(=O)[C@@H](NC(=O)[C@](C)(Cc2ccccc2F)NC(=O)[C@@H]2CSSC[C@H](NC(=O)[C@@H](N)Cc3cnc[nH]3)C(=O)N[C@@H](CCC(O)=O)C(=O)NCC(=O)N2)[C@@H](C)O)C(=O)N[C@@H](CCCc2ccccc2)C(N)=O)cc1 |r|
>3.10E+3n/an/an/an/an/an/an/an/a
University of Queensland
Curated by ChEMBL
Assay Description
Displacement of [125I]-17 from human GLP-1R expressed in CHO cell membranes incubated for 120 mins by scintillation counting based radioligand bindin...
J Med Chem 58: 4080-5 (2015)
Article DOI: 10.1021/acs.jmedchem.5b00166
BindingDB Entry DOI: 10.7270/Q2DB83KP
Glucagon-like peptide 1 receptor (GLP-1)
(Homo sapiens (Human))
BDBM50086592
(CHEMBL3426247)
Show SMILES CCc1cc(OC)ccc1-c1ccc(C[C@H](NC(=O)[C@H](CC(O)=O)NC(=O)[C@H](CO)NC(=O)[C@@H](NC(=O)[C@](C)(Cc2ccccc2F)NC(=O)[C@@H]2CSSC[C@H](NC(=O)[C@@H](N)Cc3cnc[nH]3)C(=O)N[C@@H](CCC(O)=O)C(=O)NCC(=O)N2)[C@@H](C)O)C(=O)N[C@@H](CCCc2ccccc2)C(N)=O)cc1 |r|
n/an/an/an/a 670n/an/an/an/a
University of Queensland
Curated by ChEMBL
Assay Description
Agonist activity at human GLP-1R expressed in CHO cells assessed as cAMP accumulation incubated for 30 mins
J Med Chem 58: 4080-5 (2015)
Article DOI: 10.1021/acs.jmedchem.5b00166
BindingDB Entry DOI: 10.7270/Q2DB83KP