BDBM50086853 CHEMBL82652::Cyclohexanecarboxylic acid ((R)-1-phenethyl-pyrrolidin-2-ylmethyl)-amide
SMILES: O=C(NC[C@H]1CCCN1CCc1ccccc1)C1CCCCC1
InChI Key: InChIKey=LJIIUDVZDYITID-LJQANCHMSA-N
Data: 2 KI  3 IC50
Activity Spreadsheet -- Enzyme Inhibition Constant Data from BindingDB
Found 5 hits for monomerid = 50086853
Trg + Lig
Ki
nM
ΔG°
kcal/mole
IC50
nM
Kd
nM
EC50/IC50
nM
koff
s-1
kon
M-1s-1
pHTemp
°C
5-hydroxytryptamine receptor 1A
(Rattus norvegicus (rat))
BDBM50086853
(CHEMBL82652 | Cyclohexanecarboxylic acid ((R)-1-ph...)
Show SMILES O=C(NC[C@H]1CCCN1CCc1ccccc1)C1CCCCC1
Show InChI InChI=1S/C20H30N2O/c23-20(18-10-5-2-6-11-18)21-16-19-12-7-14-22(19)15-13-17-8-3-1-4-9-17/h1,3-4,8-9,18-19H,2,5-7,10-16H2,(H,21,23)/t19-/m1/s1
190n/an/an/an/an/an/an/an/a
Yoshitomi Pharmaceutical Industries, Ltd.
Curated by ChEMBL
Assay Description
Displacement of [3H]-8-OH-DPAT from rat striata 5-hydroxytryptamine 1A receptor
Bioorg Med Chem Lett 10: 509-12 (2000)
BindingDB Entry DOI: 10.7270/Q24Q7T7T
5-hydroxytryptamine receptor 1A
(Rattus norvegicus (rat))
BDBM50086853
(CHEMBL82652 | Cyclohexanecarboxylic acid ((R)-1-ph...)
Show SMILES O=C(NC[C@H]1CCCN1CCc1ccccc1)C1CCCCC1
Show InChI InChI=1S/C20H30N2O/c23-20(18-10-5-2-6-11-18)21-16-19-12-7-14-22(19)15-13-17-8-3-1-4-9-17/h1,3-4,8-9,18-19H,2,5-7,10-16H2,(H,21,23)/t19-/m1/s1
190n/an/an/an/an/an/an/an/a
Welfide Corporation
Curated by ChEMBL
Assay Description
Binding affinity at 5-hydroxytryptamine 1A receptor from striata of wistar rats by [3H]- 8-OH -DPAT displacement.
Bioorg Med Chem Lett 10: 2457-61 (2001)
BindingDB Entry DOI: 10.7270/Q2VT1SN2
Serotonin 2 (5-HT2) receptor
(Rattus norvegicus (rat)-RAT-Rattus norvegicus (Rat...)
BDBM50086853
(CHEMBL82652 | Cyclohexanecarboxylic acid ((R)-1-ph...)
Show SMILES O=C(NC[C@H]1CCCN1CCc1ccccc1)C1CCCCC1
Show InChI InChI=1S/C20H30N2O/c23-20(18-10-5-2-6-11-18)21-16-19-12-7-14-22(19)15-13-17-8-3-1-4-9-17/h1,3-4,8-9,18-19H,2,5-7,10-16H2,(H,21,23)/t19-/m1/s1
n/an/a>1.00E+3n/an/an/an/an/an/a
Welfide Corporation
Curated by ChEMBL
Assay Description
The compound was evaluated for the ability to displace [3H]ketanserin from 5-hydroxytryptamine 2 receptor ( striata of male wistar rats)
Bioorg Med Chem Lett 10: 2457-61 (2001)
BindingDB Entry DOI: 10.7270/Q2VT1SN2
D(2) dopamine receptor
(Homo sapiens (Human))
BDBM50086853
(CHEMBL82652 | Cyclohexanecarboxylic acid ((R)-1-ph...)
Show SMILES O=C(NC[C@H]1CCCN1CCc1ccccc1)C1CCCCC1
Show InChI InChI=1S/C20H30N2O/c23-20(18-10-5-2-6-11-18)21-16-19-12-7-14-22(19)15-13-17-8-3-1-4-9-17/h1,3-4,8-9,18-19H,2,5-7,10-16H2,(H,21,23)/t19-/m1/s1
Reactome pathway
n/an/a>1.00E+3n/an/an/an/an/an/a
Yoshitomi Pharmaceutical Industries, Ltd.
Curated by ChEMBL
Assay Description
Inhibitory concentration of the compound against binding of Dopamine receptor D2 by displacement of [3H]-spiperone
Bioorg Med Chem Lett 10: 509-12 (2000)
BindingDB Entry DOI: 10.7270/Q24Q7T7T
Serotonin 2 (5-HT2) receptor
(Rattus norvegicus (rat)-RAT-Rattus norvegicus (Rat...)
BDBM50086853
(CHEMBL82652 | Cyclohexanecarboxylic acid ((R)-1-ph...)
Show SMILES O=C(NC[C@H]1CCCN1CCc1ccccc1)C1CCCCC1
Show InChI InChI=1S/C20H30N2O/c23-20(18-10-5-2-6-11-18)21-16-19-12-7-14-22(19)15-13-17-8-3-1-4-9-17/h1,3-4,8-9,18-19H,2,5-7,10-16H2,(H,21,23)/t19-/m1/s1
n/an/a>1.00E+3n/an/an/an/an/an/a
Yoshitomi Pharmaceutical Industries, Ltd.
Curated by ChEMBL
Assay Description
Inhibitory concentration against 5-hydroxytryptamine 2 receptor from striata of male Wistar rats by displacement of [3H]-ketanserin
Bioorg Med Chem Lett 10: 509-12 (2000)
BindingDB Entry DOI: 10.7270/Q24Q7T7T