BDBM50087617 2-[1-benzyl-2-oxo-(5S)-dihydro-1H-5-pyrrolylcarboxamido]-3-[4-(3-trifluoromethylphenylsulfonamido)phenyl]-(2S)-propanoic acid::CHEMBL421838
SMILES: OC(=O)[C@H](Cc1ccc(NS(=O)(=O)c2cccc(c2)C(F)(F)F)cc1)NC(=O)[C@@H]1CCC(=O)N1Cc1ccccc1
InChI Key: InChIKey=MLRNFSVKZBPRQY-ZEQRLZLVSA-N
Data: 2 IC50
Activity Spreadsheet -- Enzyme Inhibition Constant Data from BindingDB
Found 2 hits for monomerid = 50087617
Trg + Lig
Ki
nM
ΔG°
kcal/mole
IC50
nM
Kd
nM
EC50/IC50
nM
koff
s-1
kon
M-1s-1
pHTemp
°C
Fibronectin receptor beta/Integrin alpha-4
(Homo sapiens (Human))
BDBM50087617
(2-[1-benzyl-2-oxo-(5S)-dihydro-1H-5-pyrrolylcarbox...)
Show SMILES OC(=O)[C@H](Cc1ccc(NS(=O)(=O)c2cccc(c2)C(F)(F)F)cc1)NC(=O)[C@@H]1CCC(=O)N1Cc1ccccc1
Show InChI InChI=1S/C28H26F3N3O6S/c29-28(30,31)20-7-4-8-22(16-20)41(39,40)33-21-11-9-18(10-12-21)15-23(27(37)38)32-26(36)24-13-14-25(35)34(24)17-19-5-2-1-3-6-19/h1-12,16,23-24,33H,13-15,17H2,(H,32,36)(H,37,38)/t23-,24-/m0/s1
Reactome pathway
n/an/a 20n/an/an/an/an/an/a
Hoffmann-La Roche Inc.
Curated by ChEMBL
Assay Description
Antagonistic activity against VLA-4 (derived from ramos cells) binding to recombinant human VCAM by ELISA assay
Bioorg Med Chem Lett 10: 729-33 (2000)
BindingDB Entry DOI: 10.7270/Q2125TXJ
Fibronectin receptor beta/Integrin alpha-4
(Homo sapiens (Human))
BDBM50087617
(2-[1-benzyl-2-oxo-(5S)-dihydro-1H-5-pyrrolylcarbox...)
Show SMILES OC(=O)[C@H](Cc1ccc(NS(=O)(=O)c2cccc(c2)C(F)(F)F)cc1)NC(=O)[C@@H]1CCC(=O)N1Cc1ccccc1
Show InChI InChI=1S/C28H26F3N3O6S/c29-28(30,31)20-7-4-8-22(16-20)41(39,40)33-21-11-9-18(10-12-21)15-23(27(37)38)32-26(36)24-13-14-25(35)34(24)17-19-5-2-1-3-6-19/h1-12,16,23-24,33H,13-15,17H2,(H,32,36)(H,37,38)/t23-,24-/m0/s1
Reactome pathway
n/an/a 2.60E+4n/an/an/an/an/an/a
Hoffmann-La Roche Inc.
Curated by ChEMBL
Assay Description
Antagonistic activity against VLA-4 binding to recombinant human VCAM by ramos cell assay
Bioorg Med Chem Lett 10: 729-33 (2000)
BindingDB Entry DOI: 10.7270/Q2125TXJ