BDBM50087630 2-[1-benzyl-2-oxo-(5S)-dihydro-1H-5-pyrrolylcarboxamido]-3-(4-phenethylphenyl)-(2S)-propanoic acid::CHEMBL166133
SMILES: OC(=O)[C@H](Cc1ccc(CCc2ccccc2)cc1)NC(=O)[C@@H]1CCC(=O)N1Cc1ccccc1
InChI Key: InChIKey=CVUWQLOLIZSXAC-UIOOFZCWSA-N
Data: 1 IC50
Activity Spreadsheet -- Enzyme Inhibition Constant Data from BindingDB
Found 1 hit for monomerid = 50087630
Trg + Lig
Ki
nM
ΔG°
kcal/mole
IC50
nM
Kd
nM
EC50/IC50
nM
koff
s-1
kon
M-1s-1
pHTemp
°C
Fibronectin receptor beta/Integrin alpha-4
(Homo sapiens (Human))
BDBM50087630
(2-[1-benzyl-2-oxo-(5S)-dihydro-1H-5-pyrrolylcarbox...)
Show SMILES OC(=O)[C@H](Cc1ccc(CCc2ccccc2)cc1)NC(=O)[C@@H]1CCC(=O)N1Cc1ccccc1
Show InChI InChI=1S/C29H30N2O4/c32-27-18-17-26(31(27)20-24-9-5-2-6-10-24)28(33)30-25(29(34)35)19-23-15-13-22(14-16-23)12-11-21-7-3-1-4-8-21/h1-10,13-16,25-26H,11-12,17-20H2,(H,30,33)(H,34,35)/t25-,26-/m0/s1
Reactome pathway
n/an/a 38n/an/an/an/an/an/a
Hoffmann-La Roche Inc.
Curated by ChEMBL
Assay Description
Antagonistic activity against VLA-4 binding to recombinant human VCAM by ramos cell assay
Bioorg Med Chem Lett 10: 729-33 (2000)
BindingDB Entry DOI: 10.7270/Q2125TXJ