BDBM50087673 Biphenyl-2-carboxylic acid {3-methoxy-4-[3-(4-methyl-piperazin-1-ylmethyl)-5H,11H-benzo[e]pyrrolo[1,2-a][1,4]diazepine-10-carbonyl]-phenyl}-amide::CHEMBL351019
SMILES: COc1cc(NC(=O)c2ccccc2-c2ccccc2)ccc1C(=O)N1Cc2ccc(CN3CCN(C)CC3)n2Cc2ccccc12
InChI Key: InChIKey=SUAPLVPXYIPBOE-UHFFFAOYSA-N
Data: 1 IC50
Activity Spreadsheet -- Enzyme Inhibition Constant Data from BindingDB
Found 1 hit for monomerid = 50087673
Trg + Lig
Ki
nM
ΔG°
kcal/mole
IC50
nM
Kd
nM
EC50/IC50
nM
koff
s-1
kon
M-1s-1
pHTemp
°C
Vasopressin V2 receptor
(Homo sapiens (Human))
BDBM50087673
(Biphenyl-2-carboxylic acid {3-methoxy-4-[3-(4-meth...)
Show SMILES COc1cc(NC(=O)c2ccccc2-c2ccccc2)ccc1C(=O)N1Cc2ccc(CN3CCN(C)CC3)n2Cc2ccccc12
Show InChI InChI=1S/C39H39N5O3/c1-41-20-22-42(23-21-41)26-31-17-18-32-27-44(36-15-9-6-12-29(36)25-43(31)32)39(46)35-19-16-30(24-37(35)47-2)40-38(45)34-14-8-7-13-33(34)28-10-4-3-5-11-28/h3-19,24H,20-23,25-27H2,1-2H3,(H,40,45)
n/an/a 7n/an/an/an/an/an/a
Wyeth-Ayerst Research
Curated by ChEMBL
Assay Description
Displacement of [3H]-AVP from human vasopressin V2-receptor expressed in murine fibroblast cell (LV2) membranes
Bioorg Med Chem Lett 10: 783-6 (2000)
BindingDB Entry DOI: 10.7270/Q24M93RK