BDBM50087678 CHEMBL168507::Sodium; {3-[(E)-7-(4-azido-3-iodo-phenyl)-3-hydroxy-hept-1-enyl]-1-hydroxy-cyclohexyl}-acetate
SMILES: OC(CCCCc1ccc(N=[N+]=[N-])c(I)c1)\C=C\C1CCCC(O)(CC(O)=O)C1
InChI Key: InChIKey=MQEYNODERAXEDU-VQHVLOKHSA-N
Data: 1 IC50
Activity Spreadsheet -- Enzyme Inhibition Constant Data from BindingDB
Found 1 hit for monomerid = 50087678
Trg + Lig
Ki
nM
ΔG°
kcal/mole
IC50
nM
Kd
nM
EC50/IC50
nM
koff
s-1
kon
M-1s-1
pHTemp
°C
Leukotriene B4 receptor
(Homo sapiens (Human))
BDBM50087678
(CHEMBL168507 | Sodium; {3-[(E)-7-(4-azido-3-iodo-p...)
Show SMILES OC(CCCCc1ccc(N=[N+]=[N-])c(I)c1)\C=C\C1CCCC(O)(CC(O)=O)C1
Show InChI InChI=1S/C21H28IN3O4/c22-18-12-15(8-10-19(18)24-25-23)4-1-2-6-17(26)9-7-16-5-3-11-21(29,13-16)14-20(27)28/h7-10,12,16-17,26,29H,1-6,11,13-14H2,(H,27,28)/b9-7+
n/an/a>1.00E+4n/an/an/an/an/an/a
UPRESA-CNRS 5074
Curated by ChEMBL
Assay Description
Compound was tested for inhibition against binding of radioligand [3H]-LTB4 to Leukotriene B4 receptor in human neutrophil membranes
Bioorg Med Chem Lett 10: 811-4 (2000)
BindingDB Entry DOI: 10.7270/Q2W37VHF