BDBM50087706 CHEMBL265847::Urotensin-1-sucker fish(NDDPPISIDLTFHLLRNMIEMARIENEREQAGLNRKYLDEV-NH2)
SMILES:
InChI Key: InChIKey=YIHRBRJTFIGRRV-MVZVNDLMSA-N
Data: 2 KI  2 EC50
Activity Spreadsheet -- Enzyme Inhibition Constant Data from BindingDB
Found 4 hits for monomerid = 50087706
Trg + Lig
Ki
nM
ΔG°
kcal/mole
IC50
nM
Kd
nM
EC50/IC50
nM
koff
s-1
kon
M-1s-1
pHTemp
°C
Corticotropin releasing factor receptor 1
(Homo sapiens (Human))
BDBM50087706
(CHEMBL265847 | Urotensin-1-sucker fish(NDDPPISIDLT...)
Show InChI InChI=1S/C210H340N62O67S2/c1-26-103(17)162(200(333)249-124(58-64-155(288)289)181(314)258-138(86-148(215)278)193(326)244-122(56-62-153(284)285)178(311)239-116(44-35-69-228-206(219)220)175(308)243-121(55-61-152(282)283)179(312)242-120(54-60-146(213)276)172(305)234-107(21)169(302)232-94-151(281)236-130(77-97(5)6)185(318)259-140(88-150(217)280)192(325)241-117(45-36-70-229-207(221)222)174(307)238-115(43-33-34-68-211)176(309)255-135(83-111-50-52-113(275)53-51-111)189(322)252-133(80-100(11)12)188(321)260-141(91-159(296)297)195(328)245-125(59-65-156(290)291)183(316)265-161(102(15)16)168(218)301)266-182(315)119(47-38-72-231-209(225)226)237-170(303)108(22)235-173(306)126(66-75-340-24)246-180(313)123(57-63-154(286)287)248-201(334)163(104(18)27-2)267-184(317)127(67-76-341-25)247-194(327)139(87-149(216)279)257-177(310)118(46-37-71-230-208(223)224)240-186(319)131(78-98(7)8)251-187(320)132(79-99(9)10)253-191(324)137(84-112-93-227-96-233-112)256-190(323)136(82-110-41-31-30-32-42-110)261-204(337)166(109(23)274)270-197(330)134(81-101(13)14)254-196(329)142(92-160(298)299)262-202(335)164(105(19)28-3)268-198(331)143(95-273)263-203(336)165(106(20)29-4)269-199(332)144-48-39-73-271(144)205(338)145-49-40-74-272(145)210(339)264-129(90-158(294)295)167(300)128(89-157(292)293)250-171(304)114(212)85-147(214)277/h30-32,41-42,50-53,93,96-109,114-145,161-166,273-275H,26-29,33-40,43-49,54-92,94-95,211-212H2,1-25H3,(H2,213,276)(H2,214,277)(H2,215,278)(H2,216,279)(H2,217,280)(H2,218,301)(H,227,233)(H,232,302)(H,234,305)(H,235,306)(H,236,281)(H,237,303)(H,238,307)(H,239,311)(H,240,319)(H,241,325)(H,242,312)(H,243,308)(H,244,326)(H,245,328)(H,246,313)(H,247,327)(H,248,334)(H,249,333)(H,250,304)(H,251,320)(H,252,322)(H,253,324)(H,254,329)(H,255,309)(H,256,323)(H,257,310)(H,258,314)(H,259,318)(H,260,321)(H,261,337)(H,262,335)(H,263,336)(H,264,339)(H,265,316)(H,266,315)(H,267,317)(H,268,331)(H,269,332)(H,270,330)(H,282,283)(H,284,285)(H,286,287)(H,288,289)(H,290,291)(H,292,293)(H,294,295)(H,296,297)(H,298,299)(H4,219,220,228)(H4,221,222,229)(H4,223,224,230)(H4,225,226,231)/t103-,104-,105-,106-,107-,108-,109?,114?,115-,116-,117-,118-,119-,120-,121-,122-,123-,124-,125-,126-,127-,128?,129?,130-,131-,132-,133-,134-,135-,136-,137-,138-,139-,140-,141-,142-,143-,144-,145+,161-,162-,163-,164-,165?,166-/m0/s1
Reactome pathway
1.07n/an/an/an/an/an/an/an/a
DuPont Pharmaceuticals Company
Curated by ChEMBL
Assay Description
Binding affinity of the receptor corticotropin releasing factor receptor with peptidic agonists
J Med Chem 43: 1641-60 (2000)
BindingDB Entry DOI: 10.7270/Q29S1RRP
Corticotropin releasing factor receptor 2
(Homo sapiens (Human))
BDBM50087706
(CHEMBL265847 | Urotensin-1-sucker fish(NDDPPISIDLT...)
Show InChI InChI=1S/C210H340N62O67S2/c1-26-103(17)162(200(333)249-124(58-64-155(288)289)181(314)258-138(86-148(215)278)193(326)244-122(56-62-153(284)285)178(311)239-116(44-35-69-228-206(219)220)175(308)243-121(55-61-152(282)283)179(312)242-120(54-60-146(213)276)172(305)234-107(21)169(302)232-94-151(281)236-130(77-97(5)6)185(318)259-140(88-150(217)280)192(325)241-117(45-36-70-229-207(221)222)174(307)238-115(43-33-34-68-211)176(309)255-135(83-111-50-52-113(275)53-51-111)189(322)252-133(80-100(11)12)188(321)260-141(91-159(296)297)195(328)245-125(59-65-156(290)291)183(316)265-161(102(15)16)168(218)301)266-182(315)119(47-38-72-231-209(225)226)237-170(303)108(22)235-173(306)126(66-75-340-24)246-180(313)123(57-63-154(286)287)248-201(334)163(104(18)27-2)267-184(317)127(67-76-341-25)247-194(327)139(87-149(216)279)257-177(310)118(46-37-71-230-208(223)224)240-186(319)131(78-98(7)8)251-187(320)132(79-99(9)10)253-191(324)137(84-112-93-227-96-233-112)256-190(323)136(82-110-41-31-30-32-42-110)261-204(337)166(109(23)274)270-197(330)134(81-101(13)14)254-196(329)142(92-160(298)299)262-202(335)164(105(19)28-3)268-198(331)143(95-273)263-203(336)165(106(20)29-4)269-199(332)144-48-39-73-271(144)205(338)145-49-40-74-272(145)210(339)264-129(90-158(294)295)167(300)128(89-157(292)293)250-171(304)114(212)85-147(214)277/h30-32,41-42,50-53,93,96-109,114-145,161-166,273-275H,26-29,33-40,43-49,54-92,94-95,211-212H2,1-25H3,(H2,213,276)(H2,214,277)(H2,215,278)(H2,216,279)(H2,217,280)(H2,218,301)(H,227,233)(H,232,302)(H,234,305)(H,235,306)(H,236,281)(H,237,303)(H,238,307)(H,239,311)(H,240,319)(H,241,325)(H,242,312)(H,243,308)(H,244,326)(H,245,328)(H,246,313)(H,247,327)(H,248,334)(H,249,333)(H,250,304)(H,251,320)(H,252,322)(H,253,324)(H,254,329)(H,255,309)(H,256,323)(H,257,310)(H,258,314)(H,259,318)(H,260,321)(H,261,337)(H,262,335)(H,263,336)(H,264,339)(H,265,316)(H,266,315)(H,267,317)(H,268,331)(H,269,332)(H,270,330)(H,282,283)(H,284,285)(H,286,287)(H,288,289)(H,290,291)(H,292,293)(H,294,295)(H,296,297)(H,298,299)(H4,219,220,228)(H4,221,222,229)(H4,223,224,230)(H4,225,226,231)/t103-,104-,105-,106-,107-,108-,109?,114?,115-,116-,117-,118-,119-,120-,121-,122-,123-,124-,125-,126-,127-,128?,129?,130-,131-,132-,133-,134-,135-,136-,137-,138-,139-,140-,141-,142-,143-,144-,145+,161-,162-,163-,164-,165?,166-/m0/s1
1.26n/an/an/an/an/an/an/an/a
DuPont Pharmaceuticals Company
Curated by ChEMBL
Assay Description
Binding affinity of the receptor h-CRF2-alpha with peptidic agonists
J Med Chem 43: 1641-60 (2000)
BindingDB Entry DOI: 10.7270/Q29S1RRP
Corticotropin releasing factor receptor 2
(Homo sapiens (Human))
BDBM50087706
(CHEMBL265847 | Urotensin-1-sucker fish(NDDPPISIDLT...)
Show InChI InChI=1S/C210H340N62O67S2/c1-26-103(17)162(200(333)249-124(58-64-155(288)289)181(314)258-138(86-148(215)278)193(326)244-122(56-62-153(284)285)178(311)239-116(44-35-69-228-206(219)220)175(308)243-121(55-61-152(282)283)179(312)242-120(54-60-146(213)276)172(305)234-107(21)169(302)232-94-151(281)236-130(77-97(5)6)185(318)259-140(88-150(217)280)192(325)241-117(45-36-70-229-207(221)222)174(307)238-115(43-33-34-68-211)176(309)255-135(83-111-50-52-113(275)53-51-111)189(322)252-133(80-100(11)12)188(321)260-141(91-159(296)297)195(328)245-125(59-65-156(290)291)183(316)265-161(102(15)16)168(218)301)266-182(315)119(47-38-72-231-209(225)226)237-170(303)108(22)235-173(306)126(66-75-340-24)246-180(313)123(57-63-154(286)287)248-201(334)163(104(18)27-2)267-184(317)127(67-76-341-25)247-194(327)139(87-149(216)279)257-177(310)118(46-37-71-230-208(223)224)240-186(319)131(78-98(7)8)251-187(320)132(79-99(9)10)253-191(324)137(84-112-93-227-96-233-112)256-190(323)136(82-110-41-31-30-32-42-110)261-204(337)166(109(23)274)270-197(330)134(81-101(13)14)254-196(329)142(92-160(298)299)262-202(335)164(105(19)28-3)268-198(331)143(95-273)263-203(336)165(106(20)29-4)269-199(332)144-48-39-73-271(144)205(338)145-49-40-74-272(145)210(339)264-129(90-158(294)295)167(300)128(89-157(292)293)250-171(304)114(212)85-147(214)277/h30-32,41-42,50-53,93,96-109,114-145,161-166,273-275H,26-29,33-40,43-49,54-92,94-95,211-212H2,1-25H3,(H2,213,276)(H2,214,277)(H2,215,278)(H2,216,279)(H2,217,280)(H2,218,301)(H,227,233)(H,232,302)(H,234,305)(H,235,306)(H,236,281)(H,237,303)(H,238,307)(H,239,311)(H,240,319)(H,241,325)(H,242,312)(H,243,308)(H,244,326)(H,245,328)(H,246,313)(H,247,327)(H,248,334)(H,249,333)(H,250,304)(H,251,320)(H,252,322)(H,253,324)(H,254,329)(H,255,309)(H,256,323)(H,257,310)(H,258,314)(H,259,318)(H,260,321)(H,261,337)(H,262,335)(H,263,336)(H,264,339)(H,265,316)(H,266,315)(H,267,317)(H,268,331)(H,269,332)(H,270,330)(H,282,283)(H,284,285)(H,286,287)(H,288,289)(H,290,291)(H,292,293)(H,294,295)(H,296,297)(H,298,299)(H4,219,220,228)(H4,221,222,229)(H4,223,224,230)(H4,225,226,231)/t103-,104-,105-,106-,107-,108-,109?,114?,115-,116-,117-,118-,119-,120-,121-,122-,123-,124-,125-,126-,127-,128?,129?,130-,131-,132-,133-,134-,135-,136-,137-,138-,139-,140-,141-,142-,143-,144-,145+,161-,162-,163-,164-,165?,166-/m0/s1
n/an/an/an/a 1.5n/an/an/an/a
DuPont Pharmaceuticals Company
Curated by ChEMBL
Assay Description
Activity of peptidic agonists on h-CRF2-alpha receptor using agonist-stimulated adenylate cyclase assay
J Med Chem 43: 1641-60 (2000)
BindingDB Entry DOI: 10.7270/Q29S1RRP
Corticotropin releasing factor receptor 1
(Homo sapiens (Human))
BDBM50087706
(CHEMBL265847 | Urotensin-1-sucker fish(NDDPPISIDLT...)
Show InChI InChI=1S/C210H340N62O67S2/c1-26-103(17)162(200(333)249-124(58-64-155(288)289)181(314)258-138(86-148(215)278)193(326)244-122(56-62-153(284)285)178(311)239-116(44-35-69-228-206(219)220)175(308)243-121(55-61-152(282)283)179(312)242-120(54-60-146(213)276)172(305)234-107(21)169(302)232-94-151(281)236-130(77-97(5)6)185(318)259-140(88-150(217)280)192(325)241-117(45-36-70-229-207(221)222)174(307)238-115(43-33-34-68-211)176(309)255-135(83-111-50-52-113(275)53-51-111)189(322)252-133(80-100(11)12)188(321)260-141(91-159(296)297)195(328)245-125(59-65-156(290)291)183(316)265-161(102(15)16)168(218)301)266-182(315)119(47-38-72-231-209(225)226)237-170(303)108(22)235-173(306)126(66-75-340-24)246-180(313)123(57-63-154(286)287)248-201(334)163(104(18)27-2)267-184(317)127(67-76-341-25)247-194(327)139(87-149(216)279)257-177(310)118(46-37-71-230-208(223)224)240-186(319)131(78-98(7)8)251-187(320)132(79-99(9)10)253-191(324)137(84-112-93-227-96-233-112)256-190(323)136(82-110-41-31-30-32-42-110)261-204(337)166(109(23)274)270-197(330)134(81-101(13)14)254-196(329)142(92-160(298)299)262-202(335)164(105(19)28-3)268-198(331)143(95-273)263-203(336)165(106(20)29-4)269-199(332)144-48-39-73-271(144)205(338)145-49-40-74-272(145)210(339)264-129(90-158(294)295)167(300)128(89-157(292)293)250-171(304)114(212)85-147(214)277/h30-32,41-42,50-53,93,96-109,114-145,161-166,273-275H,26-29,33-40,43-49,54-92,94-95,211-212H2,1-25H3,(H2,213,276)(H2,214,277)(H2,215,278)(H2,216,279)(H2,217,280)(H2,218,301)(H,227,233)(H,232,302)(H,234,305)(H,235,306)(H,236,281)(H,237,303)(H,238,307)(H,239,311)(H,240,319)(H,241,325)(H,242,312)(H,243,308)(H,244,326)(H,245,328)(H,246,313)(H,247,327)(H,248,334)(H,249,333)(H,250,304)(H,251,320)(H,252,322)(H,253,324)(H,254,329)(H,255,309)(H,256,323)(H,257,310)(H,258,314)(H,259,318)(H,260,321)(H,261,337)(H,262,335)(H,263,336)(H,264,339)(H,265,316)(H,266,315)(H,267,317)(H,268,331)(H,269,332)(H,270,330)(H,282,283)(H,284,285)(H,286,287)(H,288,289)(H,290,291)(H,292,293)(H,294,295)(H,296,297)(H,298,299)(H4,219,220,228)(H4,221,222,229)(H4,223,224,230)(H4,225,226,231)/t103-,104-,105-,106-,107-,108-,109?,114?,115-,116-,117-,118-,119-,120-,121-,122-,123-,124-,125-,126-,127-,128?,129?,130-,131-,132-,133-,134-,135-,136-,137-,138-,139-,140-,141-,142-,143-,144-,145+,161-,162-,163-,164-,165?,166-/m0/s1
Reactome pathway
n/an/an/an/a 6.30n/an/an/an/a
DuPont Pharmaceuticals Company
Curated by ChEMBL
Assay Description
Activity of peptidic agonists on corticotropin releasing factor receptor receptor using agonist-stimulated adenylate cyclase assay
J Med Chem 43: 1641-60 (2000)
BindingDB Entry DOI: 10.7270/Q29S1RRP