BDBM50087766 1-Oxo-1H-indene-5-carboxylic acid amide::CHEMBL47831
SMILES: NC(=O)c1ccc2C(=O)C=Cc2c1
InChI Key: InChIKey=NYLQNKGRUHGHSL-UHFFFAOYSA-N
Data: 1 KI  1 EC50
Activity Spreadsheet -- Enzyme Inhibition Constant Data from BindingDB
Found 2 hits for monomerid = 50087766
Trg + Lig
Ki
nM
ΔG°
kcal/mole
IC50
nM
Kd
nM
EC50/IC50
nM
koff
s-1
kon
M-1s-1
pHTemp
°C
Human rhinovirus A protease
(Human rhinovirus B)
BDBM50087766
(1-Oxo-1H-indene-5-carboxylic acid amide | CHEMBL47...)
Show SMILES NC(=O)c1ccc2C(=O)C=Cc2c1 |c:9|
Show InChI InChI=1S/C10H7NO2/c11-10(13)7-1-3-8-6(5-7)2-4-9(8)12/h1-5H,(H2,11,13)
120n/an/an/an/an/an/an/an/a
Agouron Pharmaceuticals Inc.
Curated by ChEMBL
Assay Description
The compound was tested for binding affinity of Human Rhinovirus (HRV) 3C Protease.
J Med Chem 43: 1670-83 (2000)
BindingDB Entry DOI: 10.7270/Q2GX49ST
Human rhinovirus A protease
(Human rhinovirus B)
BDBM50087766
(1-Oxo-1H-indene-5-carboxylic acid amide | CHEMBL47...)
Show SMILES NC(=O)c1ccc2C(=O)C=Cc2c1 |c:9|
Show InChI InChI=1S/C10H7NO2/c11-10(13)7-1-3-8-6(5-7)2-4-9(8)12/h1-5H,(H2,11,13)
n/an/an/an/a>2.00E+4n/an/an/an/a
Agouron Pharmaceuticals Inc.
Curated by ChEMBL
Assay Description
Antiviral activity using H1HeLa cells (ATCC) infected with HRV-14
J Med Chem 43: 1670-83 (2000)
BindingDB Entry DOI: 10.7270/Q2GX49ST